{"text_format":"1","workbook":"xlsx","n_sheets":8,"sheets":["Distribution","Start","Grading Scale","Z-score Warning","Instructions","Scores","GradGrades","Calculations"],"not_rendered":{"charts":2,"images":0,"macros":1,"external_links":0,"defined_names":2,"comments":0,"pivot_tables":0},"unopened":[{"sheet":"Distribution","index":0,"reason":"not_a_worksheet"}],"bounds":{"document_bytes":16777216,"sheet_cells":100000,"rows_first":2000,"rows_last":500,"rows_between":2000,"halvings":0,"cell_chars":16384,"cell_head_chars":4096},"cells_cut":0,"cells_raw":0,"read":"whole","date_system":"1900"}

{"sheet":"Start","index":1,"n_rows":28,"n_cols":27,"rows_kept":28,"cut":false,"hidden":false,"merged":[]}
["Welcome to eZ-Score.",null,null,null,null,null,null,null,null,null,null,null,null,null,null,null,null,null,null,null,null,null,null,null,null,null,"Hawkins-Leon"]
["EZ-Score 4.02 and eZ-Score 4.02 xls  and EZ-SCORE Copyright 2002 Jeffrey E. Stake  All rights reserved."]
[]
["The copyright to this software belongs to Jeffrey E. Stake."]
["The purchaser obtains only a license to use the software to calculate grades for students for whom the purchaser bears the official responsibility "]
["for assigning grades.  Any other use or copying of this software constitutes a violation of this license agreement.  "]
["Liability for defects in this software is limited to a refund of the purchase price, unless otherwise affirmatively prohibited by law."]
["Use of this software constitutes agreement to these terms."]
[]
["You may try this software to see whether it is useful to you. For use after a few trials, please send $19 to:"]
["Jeff Stake"]
["3707 Rachel's Glen Road, Bloomington Indiana  47408"]
[]
[]
["This template should make it easier to create final grades from a group of subscores."]
["You will complete the following steps to get your grading done:"]
["add students to the initial class of 3"]
["enter scores into the spaces (called \"cells\") for the student scores, and SAVE your work"]
["choose whether to use the Z-score method of adding subscores to get total scores; some advice is available by clicking the \"warning\" tab below"]
["enter a target mean and target standard deviation for the class"]
["tinker with the target mean and standard deviation until you get a distribution that is consistent with other grading at your school"]
["sort the scores by ID, Name, or Total score"]
["print your results"]
["save the file"]
[]
["IMPORTANT!"]
["Before you start entering scores and calculating grades, you must edit EZGrader's grading scale to match your school's grading scale."]
["To go to the sheet with the grading scale, click on the \"Grading Scale\" tab below.  "]

{"sheet":"Grading Scale","index":2,"n_rows":31,"n_cols":33,"rows_kept":31,"cut":false,"hidden":false,"merged":[]}
[null,"numerical values",null,null,null,"Count?","  (minimum)",null,"suggested",null,null,0,{"$f":"1+L1","v":1},2,3,4,5,6,7,8,9,10,11,12,13,14,15,16,17,18,19,20,21]
["Count?","grade",null,"Count?","grade","yes","    cutoffs",null,"      cutoff",null,null,null,{"$f":"Calculations!T12","v":0},{"$f":"Calculations!T11","v":0},{"$f":"Calculations!T10","v":0},{"$f":"Calculations!T9","v":0},{"$f":"Calculations!T8","v":0},{"$f":"Calculations!T7","v":0},{"$f":"Calculations!T6","v":0},{"$f":"Calculations!T5","v":0},{"$f":"Calculations!T4","v":2},{"$f":"Calculations!T3","v":0},{"$f":"Calculations!T2","v":1},{"$f":"Calculations!T1","v":0}]
["yes",4,"A","yes",2,"C",{"$f":"I3","v":3.85},{"$f":"C3","v":"A"},{"$f":"(B3+B5)/2","v":3.85}]
["Count?","grade",null,"Count?","grade",null,3.5,{"$f":"C5","v":"A-   "},{"$f":"(B5+B7)/2","v":3.5}]
["yes",3.7,"A-   ","yes",1.7,"C-   ",3.15,{"$f":"C7","v":"B+"},{"$f":"(B7+B9)/2","v":3.15}]
["Count?","grade",null,"Count?","grade",null,2.85,{"$f":"C9","v":"B    "},{"$f":"(B9+B11)/2","v":2.85}]
["yes",3.3,"B+","yes",1.3,"D+   ",2.5,{"$f":"C11","v":"B-   "},{"$f":"(B11+B13)/2","v":2.5}]
["Count?","grade",null,"Count?","grade",null,2.15,{"$f":"C13","v":"C+   "},{"$f":"(B13+E3)/2","v":2.15}]
["yes",3,"B    ","yes",1,"D    ",1.85,{"$f":"F3","v":"C"},{"$f":"(E3+E5)/2","v":1.85}]
["Count?","grade",null,"Count?","grade",null,1.5,{"$f":"F5","v":"C-   "},{"$f":"(E5+E7)/2","v":1.5}]
["yes",2.7,"B-   ","yes",0,"F    ",1.1499999999999999,{"$f":"F7","v":"D+   "},{"$f":"(E7+E9)/2","v":1.1499999999999999}]
["Count?","grade",null,"Count?","grade",null,0.5,{"$f":"F9","v":"D    "},{"$f":"(E9+E11)/2","v":0.5}]
["yes",2.2999999999999998,"C+   ","yes",-9,"F-?",-4.5,{"$f":"F11","v":"F    "},{"$f":"(E11+E13)/2","v":-4.5}]
[null,null,null,null,null,null,null,{"$f":"F13","v":"F-?"}]
["Examine the blue data, both the letter grades and their numerical equivalents. All Grades are based on this numerical scale."]
["The blue numbers and letters should match your school's grading scale. Notice that an A- is 3.7, not 3.66, for example."]
["Make such changes as are necessary by moving the cursor to the cells needing changing and enter new values as needed."]
["Change ONLY cells with blue contents."]
["When the scale fits your school, SAVE this template and then click the Grades tab below."]
[]
["To the right of the grades there is a suggested cutoff column. Those cutoffs are points halfway between the grades to the left. "]
["The minimum cutoffs used by the program are in pink, and can be changed, but do not change them unless you know what you are doing."]
[]
["If your school has more than 12 useful grade intervals, it might be better not to use this program."]
[]
["When the scale fits your school, SAVE this template."]
[]
["You will next enter the data for the students and calculate their grades."]
["To get to the sheet for that, click the Grades tab below."]
[]
["Some additional help is provided on the \"Instructions\" sheet. Click on the tab to turn to that sheet."]

{"sheet":"Z-score Warning","index":3,"n_rows":14,"n_cols":1,"rows_kept":14,"cut":false,"hidden":false,"merged":[]}
["Regarding the use of the Z-score method, "]
["There is one important warning:"]
["If the scores on one of the subparts are essentially the same, the differences between"]
["students on that part might not be very important.  If that is the case, either do not give"]
["that part much weight or do not use the Z-score method of weighting."]
[]
["One other time that you might not want to use the Z-score method is when"]
["one group of students has a grade on one part and another group has a grade on a"]
["different part.  It is best if each student has a grade in each column used.  If not, "]
["it might be better not to use the Z-score method."]
["Otherwise, the Z-score method is ordinarily recommended for weighting subscores."]
[]
["The Z-scores are calculated based on only the students that were included by having \"yes\" in the far left column."]
["This allows you to exclude some students from the calculations, although the program will still calculate the grades for the excluded students."]

{"sheet":"Instructions","index":4,"n_rows":36,"n_cols":1,"rows_kept":36,"cut":false,"hidden":false,"merged":[]}
["Cursor around the sheet using the arrow keys, or the home key."]
["Type only in the cells with blue data. Typing in other cells can cause errors."]
["Ctrl+a adds another student to the class. "]
[]
["To determine whether to use the Z-score method of calculating grades, read the Z-score Warning page by clicking the tab below."]
[]
["To use the Z-score method of combining scores, type \"yes\" in the appropriate cell in the left most column of the Grades sheet."]
["To avoid using the Z-score method of combining scores, type anything other than \"yes\" in the appropriate cell in the left most column of the Grades sheet."]
["Consult the Z-score Warning page, by clicking on the tab below, for a warning about use of the Z-score method."]
[]
["In order for scores to be included in the totals, you must enter some \"weight\" for that column of scores. "]
["If you do not enter a weight for some scores, they do not count in the totals."]
[]
["For a student to count in the calculations, you must enter \"yes\" in the far left column for that student."]
["You can eliminate a student from the calculations by typing anything other than the word \"yes\" in the far left (\"count?\") column for that student."]
["When you save this file, the next time you open it it will open on the sheet you were on when you saved."]
[]
["The following macros will help you sort. (They will work correctly, however, only if you have used Ctrl+a to add students to the class.)"]
["Ctrl+i sorts by ID number"]
["Ctrl+n sorts by name"]
["Ctrl+t sorts by total"]
[]
["To give extra credit, or discredit, for attendance and talking, you must give a student a student a score of some kind and must also enter a \"factor\" at the top"]
["of that column.  The number in the row is multiplied by the number at the top, then added to the exam score for the total."]
["Click on the tabs below to turn to different sheets in the workbook."]
["The \"Distribution\" tab shows you a distribution of the class grades."]
["You will spend most of your time on the \"Grades\" sheet."]
[]
["To print in portrait mode, highlight the cells to be printed and press Ctrl+Shift+P. To print in landscape mode, highlight cells and press Ctrl+Shift+L."]
[]
["Do  Not delete rows or columns. Just put \"no\" in the left most cell of the row to take it out of the calculations, or type over the data with a different student."]
["You can change the column width or row height to essentially make a row or column too thin to see, without eliminating it."]
["If you must eliminate a row, give it a high ID number, like zzzzz, and then sort by ID, then hit the delete key while in EVERY cell of the entire row, A through Z."]
[]
["Remember  to use Ctrl+a to add students to the initial class of 3."]
["This version is limited to 250 students and 10 subscores. Versions with larger capacities can be supplied by Jeff Stake."]

{"sheet":"Scores","index":5,"n_rows":264,"n_cols":27,"rows_kept":264,"cut":false,"hidden":false,"merged":[]}
["eZ-Score",null,"Copyright 2022 Jeffrey E. Stake   All rights reserved",null,null,null,null,null,null,null,null,null,null,null,"Control-A adds more students. Do not delete ANYTHING.",null,null,null,null,null,null,null,null,null,{"$f":"Calculations!T1","v":0},{"$f":"Calculations!U1","v":"A"},{"$f":"Calculations!V1","v":0}]
["Version 5.05",null,null,"Limited to 250 students. Larger capacity versions can be supplied.",null,null,null,null,null,null,null,null,null,null,null,null,null,null,null,null,null,null,null,null,{"$f":"Calculations!T2","v":1},{"$f":"Calculations!U2","v":"A-   "},{"$f":"Calculations!V2","v":0.33333333333333331}]
["If you see \"Security Warning Macros have been disabled.\" above, click \"Options\", \"Enable this content\", OK",null,null,null,null,null,null,null,null,null,null,null,null,null,null,null,null,null,null,null,null,null,null,null,{"$f":"Calculations!T3","v":0},{"$f":"Calculations!U3","v":"B+"},{"$f":"Calculations!V3","v":0}]
["Enter new data over blue data ONLY. Typing in other cells can cause errors.",null,null,null,null,null,null,null,null,null,null,null,null,null,null,null,null,null,null,null,"Target",null,null,"Results",{"$f":"Calculations!T4","v":2},{"$f":"Calculations!U4","v":"B    "},{"$f":"Calculations!V4","v":0.66666666666666663}]
[null,null,{"$f":"Calculations!D10","v":" "},null,null,null,null,null,null,null,null,null,null,null,null,null,null,null,null,null,3.22,{"$f":"IF(X7<=10,\"ok\",IF(A7=\"yes\",IF(X5>=3.305,\"Too High\",IF(X5<3.2,\"too low\",\"ok\")),IF(X7<=18,IF(X5>=3.605,\"Too High\",IF(X5<3.3,\"too low\",\"ok\")),IF(X5>=3.405,\"Too High\",IF(X5<3.3,\"too low\",\"ok\")))))","v":"ok"},"Average 3.2-3.3",{"$f":"Calculations!T14","v":3.2333333333333329},{"$f":"Calculations!T5","v":0},{"$f":"Calculations!U5","v":"B-   "},{"$f":"Calculations!V5","v":0}]
["yes","The Z-score method of weighting subscores",null,null,null,null,null,null,null,{"$f":"Calculations!I12","v":"IS being used."},null,null,null,null,null,null,null,null,null,null,0.38,{"$f":"IF(X6>0.4,\"Too High\",\"ok\")","v":"ok"},"Std. Deviation <.4",{"$f":"Calculations!T15","v":0.32998316455372523},{"$f":"Calculations!T6","v":0},{"$f":"Calculations!U6","v":"C+   "},{"$f":"Calculations!V6","v":0}]
["yes",{"$f":"IF(A7=\"yes\",\"This IS a 1L class. (enter 'no' in cell A7 to toggle)\",\"This is NOT a 1L class. ('yes' in cell A7 to toggle)\")","v":"This IS a 1L class. (enter 'no' in cell A7 to toggle)"},null,null,null,null,null,null,null,null,null,null,null,"extra","extra",null,null,null,null,null,null,null,"Class Size",{"$f":"Calculations!T16","v":3},{"$f":"Calculations!T7","v":0},{"$f":"Calculations!U7","v":"C"},{"$f":"Calculations!V7","v":0}]
[null,"average",{"$f":"Calculations!C17","v":0.33333333333333331},{"$f":"Calculations!D17","v":0},{"$f":"Calculations!E17","v":0},{"$f":"Calculations!F17","v":0},{"$f":"Calculations!G17","v":0},{"$f":"Calculations!H17","v":0},{"$f":"Calculations!I17","v":0},{"$f":"Calculations!J17","v":0},{"$f":"Calculations!K17","v":0},{"$f":"Calculations!L17","v":0},null,"credit","credit",null,null,null,null,null,null,null,"Teacher",null,{"$f":"Calculations!T8","v":0},{"$f":"Calculations!U8","v":"C-   "},{"$f":"Calculations!V8","v":0}]
[null,"std. dev.",{"$f":"Calculations!C14","v":0.47140452079103168},{"$f":"Calculations!D14","v":0},{"$f":"Calculations!E14","v":0},{"$f":"Calculations!F14","v":0},{"$f":"Calculations!G14","v":0},{"$f":"Calculations!H14","v":0},{"$f":"Calculations!I14","v":0},{"$f":"Calculations!J14","v":0},{"$f":"Calculations!K14","v":0},{"$f":"Calculations!L14","v":0},null,"factor","factor",null,null,null,null,null,null,null,"Semester",null,{"$f":"Calculations!T9","v":0},{"$f":"Calculations!U9","v":"D+   "},{"$f":"Calculations!V9","v":0}]
[null,"factor",{"$f":"Calculations!C19","v":2.1213203435596424},{"$f":"Calculations!D19","v":0},{"$f":"Calculations!E19","v":0},{"$f":"Calculations!F19","v":0},{"$f":"Calculations!G19","v":0},{"$f":"Calculations!H19","v":0},{"$f":"Calculations!I19","v":0},{"$f":"Calculations!J19","v":0},{"$f":"Calculations!K19","v":0},{"$f":"Calculations!L19","v":0},null,"for","for",null,null,null,null,null,null,null,"Year",null,{"$f":"Calculations!T10","v":0},{"$f":"Calculations!U10","v":"D    "},{"$f":"Calculations!V10","v":0}]
[null,null,null,null,null,null,null,null,null,null,null,null,"sum","attend","talk",null,null,null,null,null,null,null,"Course",null,{"$f":"Calculations!T11","v":0},{"$f":"Calculations!U11","v":"F    "},{"$f":"Calculations!V11","v":0}]
[null,"Weight =",1,0,0,0,0,0,0,0,0,0,{"$f":"Calculations!M21","v":1},0,0,null,null,null,"exam sum","exam",null,null,"final or preliminary",null,{"$f":"Calculations!T12","v":0},{"$f":"Calculations!U12","v":"F-?"},{"$f":"Calculations!V12","v":0}]
["Count?","ID#","part1","part2","part3","part4","part5","part6","part7","part8","part9","part10","name","attend","  talk","    copied total",null,null,"sum","score","total","grade","ID#","letter grade"]
["yes",123456789,1,0,0,0,0,0,0,0,0,0,"JD",0,0,2.3852991436014239,null,null,{"$f":"Calculations!P23","v":1.4142135623730951},{"$f":"Calculations!Q23","v":3.7574011537017764},{"$f":"Calculations!R23","v":3.7574011537017764},{"$f":"Calculations!S23","v":3.7},{"$f":"Calculations!T23","v":123456789},{"$f":"Calculations!U23","v":"A-   "},{"$f":"Calculations!V23","v":"BEST"}]
["yes",0,0,0,0,0,0,0,0,0,0,0,"JD",0,0,3.491760685118861,null,null,{"$f":"Calculations!P24","v":-0.70710678118654746},{"$f":"Calculations!Q24","v":2.9512994231491119},{"$f":"Calculations!R24","v":2.9512994231491119},{"$f":"Calculations!S24","v":3},{"$f":"Calculations!T24","v":0},{"$f":"Calculations!U24","v":"B    "},{"$f":"Calculations!V24","v":" "}]
["yes",0,0,0,0,0,0,0,0,0,0,0,"JD",0,0,3.1229401712797151,null,null,{"$f":"Calculations!P25","v":-0.70710678118654746},{"$f":"Calculations!Q25","v":2.9512994231491119},{"$f":"Calculations!R25","v":2.9512994231491119},{"$f":"Calculations!S25","v":3},{"$f":"Calculations!T25","v":0},{"$f":"Calculations!U25","v":"B    "},{"$f":"Calculations!V25","v":" "}]
[]
[]
[null,null,null,null,null,null,null,null,null,null,null,null,null,null,null,null,null,null,null,null,null,null,null,null,null,null,{"$f":"Calculations!X28","v":""}]
[null,null,null,null,null,null,null,null,null,null,null,null,null,null,null,null,null,null,null,null,null,null,null,null,null,null,{"$f":"Calculations!X29","v":""}]
[null,null,null,null,null,null,null,null,null,null,null,null,null,null,null,null,null,null,null,null,null,null,null,null,null,null,{"$f":"Calculations!X30","v":""}]
[null,null,null,null,null,null,null,null,null,null,null,null,null,null,null,null,null,null,null,null,null,null,null,null,null,null,{"$f":"Calculations!X31","v":""}]
[null,null,null,null,null,null,null,null,null,null,null,null,null,null,null,null,null,null,null,null,null,null,null,null,null,null,{"$f":"Calculations!X32","v":""}]
[null,null,null,null,null,null,null,null,null,null,null,null,null,null,null,null,null,null,null,null,null,null,null,null,null,null,{"$f":"Calculations!X33","v":""}]
[null,null,null,null,null,null,null,null,null,null,null,null,null,null,null,null,null,null,null,null,null,null,null,null,null,null,{"$f":"Calculations!X34","v":""}]
[null,null,null,null,null,null,null,null,null,null,null,null,null,null,null,null,null,null,null,null,null,null,null,null,null,null,{"$f":"Calculations!X35","v":""}]
[null,null,null,null,null,null,null,null,null,null,null,null,null,null,null,null,null,null,null,null,null,null,null,null,null,null,{"$f":"Calculations!X36","v":""}]
[null,null,null,null,null,null,null,null,null,null,null,null,null,null,null,null,null,null,null,null,null,null,null,null,null,null,{"$f":"Calculations!X37","v":""}]
[null,null,null,null,null,null,null,null,null,null,null,null,null,null,null,null,null,null,null,null,null,null,null,null,null,null,{"$f":"Calculations!X38","v":""}]
[null,null,null,null,null,null,null,null,null,null,null,null,null,null,null,null,null,null,null,null,null,null,null,null,null,null,{"$f":"Calculations!X39","v":""}]
[null,null,null,null,null,null,null,null,null,null,null,null,null,null,null,null,null,null,null,null,null,null,null,null,null,null,{"$f":"Calculations!X40","v":""}]
[null,null,null,null,null,null,null,null,null,null,null,null,null,null,null,null,null,null,null,null,null,null,null,null,null,null,{"$f":"Calculations!X41","v":""}]
[null,null,null,null,null,null,null,null,null,null,null,null,null,null,null,null,null,null,null,null,null,null,null,null,null,null,{"$f":"Calculations!X42","v":""}]
[null,null,null,null,null,null,null,null,null,null,null,null,null,null,null,null,null,null,null,null,null,null,null,null,null,null,{"$f":"Calculations!X43","v":""}]
[null,null,null,null,null,null,null,null,null,null,null,null,null,null,null,null,null,null,null,null,null,null,null,null,null,null,{"$f":"Calculations!X44","v":""}]
[null,null,null,null,null,null,null,null,null,null,null,null,null,null,null,null,null,null,null,null,null,null,null,null,null,null,{"$f":"Calculations!X45","v":""}]
[null,null,null,null,null,null,null,null,null,null,null,null,null,null,null,null,null,null,null,null,null,null,null,null,null,null,{"$f":"Calculations!X46","v":""}]
[null,null,null,null,null,null,null,null,null,null,null,null,null,null,null,null,null,null,null,null,null,null,null,null,null,null,{"$f":"Calculations!X47","v":""}]
[null,null,null,null,null,null,null,null,null,null,null,null,null,null,null,null,null,null,null,null,null,null,null,null,null,null,{"$f":"Calculations!X48","v":""}]
[null,null,null,null,null,null,null,null,null,null,null,null,null,null,null,null,null,null,null,null,null,null,null,null,null,null,{"$f":"Calculations!X49","v":""}]
[null,null,null,null,null,null,null,null,null,null,null,null,null,null,null,null,null,null,null,null,null,null,null,null,null,null,{"$f":"Calculations!X50","v":""}]
[null,null,null,null,null,null,null,null,null,null,null,null,null,null,null,null,null,null,null,null,null,null,null,null,null,null,{"$f":"Calculations!X51","v":""}]
[null,null,null,null,null,null,null,null,null,null,null,null,null,null,null,null,null,null,null,null,null,null,null,null,null,null,{"$f":"Calculations!X52","v":""}]
[null,null,null,null,null,null,null,null,null,null,null,null,null,null,null,null,null,null,null,null,null,null,null,null,null,null,{"$f":"Calculations!X53","v":""}]
[null,null,null,null,null,null,null,null,null,null,null,null,null,null,null,null,null,null,null,null,null,null,null,null,null,null,{"$f":"Calculations!X54","v":""}]
[null,null,null,null,null,null,null,null,null,null,null,null,null,null,null,null,null,null,null,null,null,null,null,null,null,null,{"$f":"Calculations!X55","v":""}]
[null,null,null,null,null,null,null,null,null,null,null,null,null,null,null,null,null,null,null,null,null,null,null,null,null,null,{"$f":"Calculations!X56","v":""}]
[null,null,null,null,null,null,null,null,null,null,null,null,null,null,null,null,null,null,null,null,null,null,null,null,null,null,{"$f":"Calculations!X57","v":""}]
[null,null,null,null,null,null,null,null,null,null,null,null,null,null,null,null,null,null,null,null,null,null,null,null,null,null,{"$f":"Calculations!X58","v":""}]
[null,null,null,null,null,null,null,null,null,null,null,null,null,null,null,null,null,null,null,null,null,null,null,null,null,null,{"$f":"Calculations!X59","v":""}]
[null,null,null,null,null,null,null,null,null,null,null,null,null,null,null,null,null,null,null,null,null,null,null,null,null,null,{"$f":"Calculations!X60","v":""}]
[null,null,null,null,null,null,null,null,null,null,null,null,null,null,null,null,null,null,null,null,null,null,null,null,null,null,{"$f":"Calculations!X61","v":""}]
[null,null,null,null,null,null,null,null,null,null,null,null,null,null,null,null,null,null,null,null,null,null,null,null,null,null,{"$f":"Calculations!X62","v":""}]
[null,null,null,null,null,null,null,null,null,null,null,null,null,null,null,null,null,null,null,null,null,null,null,null,null,null,{"$f":"Calculations!X63","v":""}]
[null,null,null,null,null,null,null,null,null,null,null,null,null,null,null,null,null,null,null,null,null,null,null,null,null,null,{"$f":"Calculations!X64","v":""}]
[null,null,null,null,null,null,null,null,null,null,null,null,null,null,null,null,null,null,null,null,null,null,null,null,null,null,{"$f":"Calculations!X65","v":""}]
[null,null,null,null,null,null,null,null,null,null,null,null,null,null,null,null,null,null,null,null,null,null,null,null,null,null,{"$f":"Calculations!X66","v":""}]
[null,null,null,null,null,null,null,null,null,null,null,null,null,null,null,null,null,null,null,null,null,null,null,null,null,null,{"$f":"Calculations!X67","v":""}]
[null,null,null,null,null,null,null,null,null,null,null,null,null,null,null,null,null,null,null,null,null,null,null,null,null,null,{"$f":"Calculations!X68","v":""}]
[null,null,null,null,null,null,null,null,null,null,null,null,null,null,null,null,null,null,null,null,null,null,null,null,null,null,{"$f":"Calculations!X69","v":""}]
[null,null,null,null,null,null,null,null,null,null,null,null,null,null,null,null,null,null,null,null,null,null,null,null,null,null,{"$f":"Calculations!X70","v":""}]
[null,null,null,null,null,null,null,null,null,null,null,null,null,null,null,null,null,null,null,null,null,null,null,null,null,null,{"$f":"Calculations!X71","v":""}]
[null,null,null,null,null,null,null,null,null,null,null,null,null,null,null,null,null,null,null,null,null,null,null,null,null,null,{"$f":"Calculations!X72","v":""}]
[null,null,null,null,null,null,null,null,null,null,null,null,null,null,null,null,null,null,null,null,null,null,null,null,null,null,{"$f":"Calculations!X73","v":""}]
[null,null,null,null,null,null,null,null,null,null,null,null,null,null,null,null,null,null,null,null,null,null,null,null,null,null,{"$f":"Calculations!X74","v":""}]
[null,null,null,null,null,null,null,null,null,null,null,null,null,null,null,null,null,null,null,null,null,null,null,null,null,null,{"$f":"Calculations!X75","v":""}]
[null,null,null,null,null,null,null,null,null,null,null,null,null,null,null,null,null,null,null,null,null,null,null,null,null,null,{"$f":"Calculations!X76","v":""}]
[null,null,null,null,null,null,null,null,null,null,null,null,null,null,null,null,null,null,null,null,null,null,null,null,null,null,{"$f":"Calculations!X77","v":""}]
[null,null,null,null,null,null,null,null,null,null,null,null,null,null,null,null,null,null,null,null,null,null,null,null,null,null,{"$f":"Calculations!X78","v":""}]
[null,null,null,null,null,null,null,null,null,null,null,null,null,null,null,null,null,null,null,null,null,null,null,null,null,null,{"$f":"Calculations!X79","v":""}]
[null,null,null,null,null,null,null,null,null,null,null,null,null,null,null,null,null,null,null,null,null,null,null,null,null,null,{"$f":"Calculations!X80","v":""}]
[null,null,null,null,null,null,null,null,null,null,null,null,null,null,null,null,null,null,null,null,null,null,null,null,null,null,{"$f":"Calculations!X81","v":""}]
[null,null,null,null,null,null,null,null,null,null,null,null,null,null,null,null,null,null,null,null,null,null,null,null,null,null,{"$f":"Calculations!X82","v":""}]
[null,null,null,null,null,null,null,null,null,null,null,null,null,null,null,null,null,null,null,null,null,null,null,null,null,null,{"$f":"Calculations!X83","v":""}]
[null,null,null,null,null,null,null,null,null,null,null,null,null,null,null,null,null,null,null,null,null,null,null,null,null,null,{"$f":"Calculations!X84","v":""}]
[null,null,null,null,null,null,null,null,null,null,null,null,null,null,null,null,null,null,null,null,null,null,null,null,null,null,{"$f":"Calculations!X85","v":""}]
[null,null,null,null,null,null,null,null,null,null,null,null,null,null,null,null,null,null,null,null,null,null,null,null,null,null,{"$f":"Calculations!X86","v":""}]
[null,null,null,null,null,null,null,null,null,null,null,null,null,null,null,null,null,null,null,null,null,null,null,null,null,null,{"$f":"Calculations!X87","v":""}]
[null,null,null,null,null,null,null,null,null,null,null,null,null,null,null,null,null,null,null,null,null,null,null,null,null,null,{"$f":"Calculations!X88","v":""}]
[null,null,null,null,null,null,null,null,null,null,null,null,null,null,null,null,null,null,null,null,null,null,null,null,null,null,{"$f":"Calculations!X89","v":""}]
[null,null,null,null,null,null,null,null,null,null,null,null,null,null,null,null,null,null,null,null,null,null,null,null,null,null,{"$f":"Calculations!X90","v":""}]
[null,null,null,null,null,null,null,null,null,null,null,null,null,null,null,null,null,null,null,null,null,null,null,null,null,null,{"$f":"Calculations!X91","v":""}]
[null,null,null,null,null,null,null,null,null,null,null,null,null,null,null,null,null,null,null,null,null,null,null,null,null,null,{"$f":"Calculations!X92","v":""}]
[null,null,null,null,null,null,null,null,null,null,null,null,null,null,null,null,null,null,null,null,null,null,null,null,null,null,{"$f":"Calculations!X93","v":""}]
[null,null,null,null,null,null,null,null,null,null,null,null,null,null,null,null,null,null,null,null,null,null,null,null,null,null,{"$f":"Calculations!X94","v":""}]
[null,null,null,null,null,null,null,null,null,null,null,null,null,null,null,null,null,null,null,null,null,null,null,null,null,null,{"$f":"Calculations!X95","v":""}]
[null,null,null,null,null,null,null,null,null,null,null,null,null,null,null,null,null,null,null,null,null,null,null,null,null,null,{"$f":"Calculations!X96","v":""}]
[null,null,null,null,null,null,null,null,null,null,null,null,null,null,null,null,null,null,null,null,null,null,null,null,null,null,{"$f":"Calculations!X97","v":""}]
[null,null,null,null,null,null,null,null,null,null,null,null,null,null,null,null,null,null,null,null,null,null,null,null,null,null,{"$f":"Calculations!X98","v":""}]
[null,null,null,null,null,null,null,null,null,null,null,null,null,null,null,null,null,null,null,null,null,null,null,null,null,null,{"$f":"Calculations!X99","v":""}]
[null,null,null,null,null,null,null,null,null,null,null,null,null,null,null,null,null,null,null,null,null,null,null,null,null,null,{"$f":"Calculations!X100","v":""}]
[null,null,null,null,null,null,null,null,null,null,null,null,null,null,null,null,null,null,null,null,null,null,null,null,null,null,{"$f":"Calculations!X101","v":""}]
[null,null,null,null,null,null,null,null,null,null,null,null,null,null,null,null,null,null,null,null,null,null,null,null,null,null,{"$f":"Calculations!X102","v":""}]
[null,null,null,null,null,null,null,null,null,null,null,null,null,null,null,null,null,null,null,null,null,null,null,null,null,null,{"$f":"Calculations!X103","v":""}]
[null,null,null,null,null,null,null,null,null,null,null,null,null,null,null,null,null,null,null,null,null,null,null,null,null,null,{"$f":"Calculations!X104","v":""}]
[null,null,null,null,null,null,null,null,null,null,null,null,null,null,null,null,null,null,null,null,null,null,null,null,null,null,{"$f":"Calculations!X105","v":""}]
[null,null,null,null,null,null,null,null,null,null,null,null,null,null,null,null,null,null,null,null,null,null,null,null,null,null,{"$f":"Calculations!X106","v":""}]
[null,null,null,null,null,null,null,null,null,null,null,null,null,null,null,null,null,null,null,null,null,null,null,null,null,null,{"$f":"Calculations!X107","v":""}]
[null,null,null,null,null,null,null,null,null,null,null,null,null,null,null,null,null,null,null,null,null,null,null,null,null,null,{"$f":"Calculations!X108","v":""}]
[null,null,null,null,null,null,null,null,null,null,null,null,null,null,null,null,null,null,null,null,null,null,null,null,null,null,{"$f":"Calculations!X109","v":""}]
[null,null,null,null,null,null,null,null,null,null,null,null,null,null,null,null,null,null,null,null,null,null,null,null,null,null,{"$f":"Calculations!X110","v":""}]
[null,null,null,null,null,null,null,null,null,null,null,null,null,null,null,null,null,null,null,null,null,null,null,null,null,null,{"$f":"Calculations!X111","v":""}]
[null,null,null,null,null,null,null,null,null,null,null,null,null,null,null,null,null,null,null,null,null,null,null,null,null,null,{"$f":"Calculations!X112","v":""}]
[null,null,null,null,null,null,null,null,null,null,null,null,null,null,null,null,null,null,null,null,null,null,null,null,null,null,{"$f":"Calculations!X113","v":""}]
[null,null,null,null,null,null,null,null,null,null,null,null,null,null,null,null,null,null,null,null,null,null,null,null,null,null,{"$f":"Calculations!X114","v":""}]
[null,null,null,null,null,null,null,null,null,null,null,null,null,null,null,null,null,null,null,null,null,null,null,null,null,null,{"$f":"Calculations!X115","v":""}]
[null,null,null,null,null,null,null,null,null,null,null,null,null,null,null,null,null,null,null,null,null,null,null,null,null,null,{"$f":"Calculations!X116","v":""}]
[null,null,null,null,null,null,null,null,null,null,null,null,null,null,null,null,null,null,null,null,null,null,null,null,null,null,{"$f":"Calculations!X117","v":""}]
[null,null,null,null,null,null,null,null,null,null,null,null,null,null,null,null,null,null,null,null,null,null,null,null,null,null,{"$f":"Calculations!X118","v":""}]
[null,null,null,null,null,null,null,null,null,null,null,null,null,null,null,null,null,null,null,null,null,null,null,null,null,null,{"$f":"Calculations!X119","v":""}]
[null,null,null,null,null,null,null,null,null,null,null,null,null,null,null,null,null,null,null,null,null,null,null,null,null,null,{"$f":"Calculations!X120","v":""}]
[null,null,null,null,null,null,null,null,null,null,null,null,null,null,null,null,null,null,null,null,null,null,null,null,null,null,{"$f":"Calculations!X121","v":""}]
[null,null,null,null,null,null,null,null,null,null,null,null,null,null,null,null,null,null,null,null,null,null,null,null,null,null,{"$f":"Calculations!X122","v":""}]
[null,null,null,null,null,null,null,null,null,null,null,null,null,null,null,null,null,null,null,null,null,null,null,null,null,null,{"$f":"Calculations!X123","v":""}]
[null,null,null,null,null,null,null,null,null,null,null,null,null,null,null,null,null,null,null,null,null,null,null,null,null,null,{"$f":"Calculations!X124","v":""}]
[null,null,null,null,null,null,null,null,null,null,null,null,null,null,null,null,null,null,null,null,null,null,null,null,null,null,{"$f":"Calculations!X125","v":""}]
[null,null,null,null,null,null,null,null,null,null,null,null,null,null,null,null,null,null,null,null,null,null,null,null,null,null,{"$f":"Calculations!X126","v":""}]
[null,null,null,null,null,null,null,null,null,null,null,null,null,null,null,null,null,null,null,null,null,null,null,null,null,null,{"$f":"Calculations!X127","v":""}]
[null,null,null,null,null,null,null,null,null,null,null,null,null,null,null,null,null,null,null,null,null,null,null,null,null,null,{"$f":"Calculations!X128","v":""}]
[null,null,null,null,null,null,null,null,null,null,null,null,null,null,null,null,null,null,null,null,null,null,null,null,null,null,{"$f":"Calculations!X129","v":""}]
[null,null,null,null,null,null,null,null,null,null,null,null,null,null,null,null,null,null,null,null,null,null,null,null,null,null,{"$f":"Calculations!X130","v":""}]
[null,null,null,null,null,null,null,null,null,null,null,null,null,null,null,null,null,null,null,null,null,null,null,null,null,null,{"$f":"Calculations!X131","v":""}]
[null,null,null,null,null,null,null,null,null,null,null,null,null,null,null,null,null,null,null,null,null,null,null,null,null,null,{"$f":"Calculations!X132","v":""}]
[null,null,null,null,null,null,null,null,null,null,null,null,null,null,null,null,null,null,null,null,null,null,null,null,null,null,{"$f":"Calculations!X133","v":""}]
[null,null,null,null,null,null,null,null,null,null,null,null,null,null,null,null,null,null,null,null,null,null,null,null,null,null,{"$f":"Calculations!X134","v":""}]
[null,null,null,null,null,null,null,null,null,null,null,null,null,null,null,null,null,null,null,null,null,null,null,null,null,null,{"$f":"Calculations!X135","v":""}]
[null,null,null,null,null,null,null,null,null,null,null,null,null,null,null,null,null,null,null,null,null,null,null,null,null,null,{"$f":"Calculations!X136","v":""}]
[null,null,null,null,null,null,null,null,null,null,null,null,null,null,null,null,null,null,null,null,null,null,null,null,null,null,{"$f":"Calculations!X137","v":""}]
[null,null,null,null,null,null,null,null,null,null,null,null,null,null,null,null,null,null,null,null,null,null,null,null,null,null,{"$f":"Calculations!X138","v":""}]
[null,null,null,null,null,null,null,null,null,null,null,null,null,null,null,null,null,null,null,null,null,null,null,null,null,null,{"$f":"Calculations!X139","v":""}]
[null,null,null,null,null,null,null,null,null,null,null,null,null,null,null,null,null,null,null,null,null,null,null,null,null,null,{"$f":"Calculations!X140","v":""}]
[null,null,null,null,null,null,null,null,null,null,null,null,null,null,null,null,null,null,null,null,null,null,null,null,null,null,{"$f":"Calculations!X141","v":""}]
[null,null,null,null,null,null,null,null,null,null,null,null,null,null,null,null,null,null,null,null,null,null,null,null,null,null,{"$f":"Calculations!X142","v":""}]
[null,null,null,null,null,null,null,null,null,null,null,null,null,null,null,null,null,null,null,null,null,null,null,null,null,null,{"$f":"Calculations!X143","v":""}]
[null,null,null,null,null,null,null,null,null,null,null,null,null,null,null,null,null,null,null,null,null,null,null,null,null,null,{"$f":"Calculations!X144","v":""}]
[null,null,null,null,null,null,null,null,null,null,null,null,null,null,null,null,null,null,null,null,null,null,null,null,null,null,{"$f":"Calculations!X145","v":""}]
[null,null,null,null,null,null,null,null,null,null,null,null,null,null,null,null,null,null,null,null,null,null,null,null,null,null,{"$f":"Calculations!X146","v":""}]
[null,null,null,null,null,null,null,null,null,null,null,null,null,null,null,null,null,null,null,null,null,null,null,null,null,null,{"$f":"Calculations!X147","v":""}]
[null,null,null,null,null,null,null,null,null,null,null,null,null,null,null,null,null,null,null,null,null,null,null,null,null,null,{"$f":"Calculations!X148","v":""}]
[null,null,null,null,null,null,null,null,null,null,null,null,null,null,null,null,null,null,null,null,null,null,null,null,null,null,{"$f":"Calculations!X149","v":""}]
[null,null,null,null,null,null,null,null,null,null,null,null,null,null,null,null,null,null,null,null,null,null,null,null,null,null,{"$f":"Calculations!X150","v":""}]
[null,null,null,null,null,null,null,null,null,null,null,null,null,null,null,null,null,null,null,null,null,null,null,null,null,null,{"$f":"Calculations!X151","v":""}]
[null,null,null,null,null,null,null,null,null,null,null,null,null,null,null,null,null,null,null,null,null,null,null,null,null,null,{"$f":"Calculations!X152","v":""}]
[null,null,null,null,null,null,null,null,null,null,null,null,null,null,null,null,null,null,null,null,null,null,null,null,null,null,{"$f":"Calculations!X153","v":""}]
[null,null,null,null,null,null,null,null,null,null,null,null,null,null,null,null,null,null,null,null,null,null,null,null,null,null,{"$f":"Calculations!X154","v":""}]
[null,null,null,null,null,null,null,null,null,null,null,null,null,null,null,null,null,null,null,null,null,null,null,null,null,null,{"$f":"Calculations!X155","v":""}]
[null,null,null,null,null,null,null,null,null,null,null,null,null,null,null,null,null,null,null,null,null,null,null,null,null,null,{"$f":"Calculations!X156","v":""}]
[null,null,null,null,null,null,null,null,null,null,null,null,null,null,null,null,null,null,null,null,null,null,null,null,null,null,{"$f":"Calculations!X157","v":""}]
[null,null,null,null,null,null,null,null,null,null,null,null,null,null,null,null,null,null,null,null,null,null,null,null,null,null,{"$f":"Calculations!X158","v":""}]
[null,null,null,null,null,null,null,null,null,null,null,null,null,null,null,null,null,null,null,null,null,null,null,null,null,null,{"$f":"Calculations!X159","v":""}]
[null,null,null,null,null,null,null,null,null,null,null,null,null,null,null,null,null,null,null,null,null,null,null,null,null,null,{"$f":"Calculations!X160","v":""}]
[null,null,null,null,null,null,null,null,null,null,null,null,null,null,null,null,null,null,null,null,null,null,null,null,null,null,{"$f":"Calculations!X161","v":""}]
[null,null,null,null,null,null,null,null,null,null,null,null,null,null,null,null,null,null,null,null,null,null,null,null,null,null,{"$f":"Calculations!X162","v":""}]
[null,null,null,null,null,null,null,null,null,null,null,null,null,null,null,null,null,null,null,null,null,null,null,null,null,null,{"$f":"Calculations!X163","v":""}]
[null,null,null,null,null,null,null,null,null,null,null,null,null,null,null,null,null,null,null,null,null,null,null,null,null,null,{"$f":"Calculations!X164","v":""}]
[null,null,null,null,null,null,null,null,null,null,null,null,null,null,null,null,null,null,null,null,null,null,null,null,null,null,{"$f":"Calculations!X165","v":""}]
[null,null,null,null,null,null,null,null,null,null,null,null,null,null,null,null,null,null,null,null,null,null,null,null,null,null,{"$f":"Calculations!X166","v":""}]
[null,null,null,null,null,null,null,null,null,null,null,null,null,null,null,null,null,null,null,null,null,null,null,null,null,null,{"$f":"Calculations!X167","v":""}]
[null,null,null,null,null,null,null,null,null,null,null,null,null,null,null,null,null,null,null,null,null,null,null,null,null,null,{"$f":"Calculations!X168","v":""}]
[null,null,null,null,null,null,null,null,null,null,null,null,null,null,null,null,null,null,null,null,null,null,null,null,null,null,{"$f":"Calculations!X169","v":""}]
[null,null,null,null,null,null,null,null,null,null,null,null,null,null,null,null,null,null,null,null,null,null,null,null,null,null,{"$f":"Calculations!X170","v":""}]
[null,null,null,null,null,null,null,null,null,null,null,null,null,null,null,null,null,null,null,null,null,null,null,null,null,null,{"$f":"Calculations!X171","v":""}]
[null,null,null,null,null,null,null,null,null,null,null,null,null,null,null,null,null,null,null,null,null,null,null,null,null,null,{"$f":"Calculations!X172","v":""}]
[null,null,null,null,null,null,null,null,null,null,null,null,null,null,null,null,null,null,null,null,null,null,null,null,null,null,{"$f":"Calculations!X173","v":""}]
[null,null,null,null,null,null,null,null,null,null,null,null,null,null,null,null,null,null,null,null,null,null,null,null,null,null,{"$f":"Calculations!X174","v":""}]
[null,null,null,null,null,null,null,null,null,null,null,null,null,null,null,null,null,null,null,null,null,null,null,null,null,null,{"$f":"Calculations!X175","v":""}]
[null,null,null,null,null,null,null,null,null,null,null,null,null,null,null,null,null,null,null,null,null,null,null,null,null,null,{"$f":"Calculations!X176","v":""}]
[null,null,null,null,null,null,null,null,null,null,null,null,null,null,null,null,null,null,null,null,null,null,null,null,null,null,{"$f":"Calculations!X177","v":""}]
[null,null,null,null,null,null,null,null,null,null,null,null,null,null,null,null,null,null,null,null,null,null,null,null,null,null,{"$f":"Calculations!X178","v":""}]
[null,null,null,null,null,null,null,null,null,null,null,null,null,null,null,null,null,null,null,null,null,null,null,null,null,null,{"$f":"Calculations!X179","v":""}]
[null,null,null,null,null,null,null,null,null,null,null,null,null,null,null,null,null,null,null,null,null,null,null,null,null,null,{"$f":"Calculations!X180","v":""}]
[null,null,null,null,null,null,null,null,null,null,null,null,null,null,null,null,null,null,null,null,null,null,null,null,null,null,{"$f":"Calculations!X181","v":""}]
[null,null,null,null,null,null,null,null,null,null,null,null,null,null,null,null,null,null,null,null,null,null,null,null,null,null,{"$f":"Calculations!X182","v":""}]
[null,null,null,null,null,null,null,null,null,null,null,null,null,null,null,null,null,null,null,null,null,null,null,null,null,null,{"$f":"Calculations!X183","v":""}]
[null,null,null,null,null,null,null,null,null,null,null,null,null,null,null,null,null,null,null,null,null,null,null,null,null,null,{"$f":"Calculations!X184","v":""}]
[null,null,null,null,null,null,null,null,null,null,null,null,null,null,null,null,null,null,null,null,null,null,null,null,null,null,{"$f":"Calculations!X185","v":""}]
[null,null,null,null,null,null,null,null,null,null,null,null,null,null,null,null,null,null,null,null,null,null,null,null,null,null,{"$f":"Calculations!X186","v":""}]
[null,null,null,null,null,null,null,null,null,null,null,null,null,null,null,null,null,null,null,null,null,null,null,null,null,null,{"$f":"Calculations!X187","v":""}]
[null,null,null,null,null,null,null,null,null,null,null,null,null,null,null,null,null,null,null,null,null,null,null,null,null,null,{"$f":"Calculations!X188","v":""}]
[null,null,null,null,null,null,null,null,null,null,null,null,null,null,null,null,null,null,null,null,null,null,null,null,null,null,{"$f":"Calculations!X189","v":""}]
[null,null,null,null,null,null,null,null,null,null,null,null,null,null,null,null,null,null,null,null,null,null,null,null,null,null,{"$f":"Calculations!X190","v":""}]
[null,null,null,null,null,null,null,null,null,null,null,null,null,null,null,null,null,null,null,null,null,null,null,null,null,null,{"$f":"Calculations!X191","v":""}]
[null,null,null,null,null,null,null,null,null,null,null,null,null,null,null,null,null,null,null,null,null,null,null,null,null,null,{"$f":"Calculations!X192","v":""}]
[null,null,null,null,null,null,null,null,null,null,null,null,null,null,null,null,null,null,null,null,null,null,null,null,null,null,{"$f":"Calculations!X193","v":""}]
[null,null,null,null,null,null,null,null,null,null,null,null,null,null,null,null,null,null,null,null,null,null,null,null,null,null,{"$f":"Calculations!X194","v":""}]
[null,null,null,null,null,null,null,null,null,null,null,null,null,null,null,null,null,null,null,null,null,null,null,null,null,null,{"$f":"Calculations!X195","v":""}]
[null,null,null,null,null,null,null,null,null,null,null,null,null,null,null,null,null,null,null,null,null,null,null,null,null,null,{"$f":"Calculations!X196","v":""}]
[null,null,null,null,null,null,null,null,null,null,null,null,null,null,null,null,null,null,null,null,null,null,null,null,null,null,{"$f":"Calculations!X197","v":""}]
[null,null,null,null,null,null,null,null,null,null,null,null,null,null,null,null,null,null,null,null,null,null,null,null,null,null,{"$f":"Calculations!X198","v":""}]
[null,null,null,null,null,null,null,null,null,null,null,null,null,null,null,null,null,null,null,null,null,null,null,null,null,null,{"$f":"Calculations!X199","v":""}]
[null,null,null,null,null,null,null,null,null,null,null,null,null,null,null,null,null,null,null,null,null,null,null,null,null,null,{"$f":"Calculations!X200","v":""}]
[null,null,null,null,null,null,null,null,null,null,null,null,null,null,null,null,null,null,null,null,null,null,null,null,null,null,{"$f":"Calculations!X201","v":""}]
[null,null,null,null,null,null,null,null,null,null,null,null,null,null,null,null,null,null,null,null,null,null,null,null,null,null,{"$f":"Calculations!X202","v":""}]
[null,null,null,null,null,null,null,null,null,null,null,null,null,null,null,null,null,null,null,null,null,null,null,null,null,null,{"$f":"Calculations!X203","v":""}]
[null,null,null,null,null,null,null,null,null,null,null,null,null,null,null,null,null,null,null,null,null,null,null,null,null,null,{"$f":"Calculations!X204","v":""}]
[null,null,null,null,null,null,null,null,null,null,null,null,null,null,null,null,null,null,null,null,null,null,null,null,null,null,{"$f":"Calculations!X205","v":""}]
[null,null,null,null,null,null,null,null,null,null,null,null,null,null,null,null,null,null,null,null,null,null,null,null,null,null,{"$f":"Calculations!X206","v":""}]
[null,null,null,null,null,null,null,null,null,null,null,null,null,null,null,null,null,null,null,null,null,null,null,null,null,null,{"$f":"Calculations!X207","v":""}]
[null,null,null,null,null,null,null,null,null,null,null,null,null,null,null,null,null,null,null,null,null,null,null,null,null,null,{"$f":"Calculations!X208","v":""}]
[null,null,null,null,null,null,null,null,null,null,null,null,null,null,null,null,null,null,null,null,null,null,null,null,null,null,{"$f":"Calculations!X209","v":""}]
[null,null,null,null,null,null,null,null,null,null,null,null,null,null,null,null,null,null,null,null,null,null,null,null,null,null,{"$f":"Calculations!X210","v":""}]
[null,null,null,null,null,null,null,null,null,null,null,null,null,null,null,null,null,null,null,null,null,null,null,null,null,null,{"$f":"Calculations!X211","v":""}]
[null,null,null,null,null,null,null,null,null,null,null,null,null,null,null,null,null,null,null,null,null,null,null,null,null,null,{"$f":"Calculations!X212","v":""}]
[null,null,null,null,null,null,null,null,null,null,null,null,null,null,null,null,null,null,null,null,null,null,null,null,null,null,{"$f":"Calculations!X213","v":""}]
[null,null,null,null,null,null,null,null,null,null,null,null,null,null,null,null,null,null,null,null,null,null,null,null,null,null,{"$f":"Calculations!X214","v":""}]
[null,null,null,null,null,null,null,null,null,null,null,null,null,null,null,null,null,null,null,null,null,null,null,null,null,null,{"$f":"Calculations!X215","v":""}]
[null,null,null,null,null,null,null,null,null,null,null,null,null,null,null,null,null,null,null,null,null,null,null,null,null,null,{"$f":"Calculations!X216","v":""}]
[null,null,null,null,null,null,null,null,null,null,null,null,null,null,null,null,null,null,null,null,null,null,null,null,null,null,{"$f":"Calculations!X217","v":""}]
[null,null,null,null,null,null,null,null,null,null,null,null,null,null,null,null,null,null,null,null,null,null,null,null,null,null,{"$f":"Calculations!X218","v":""}]
[null,null,null,null,null,null,null,null,null,null,null,null,null,null,null,null,null,null,null,null,null,null,null,null,null,null,{"$f":"Calculations!X219","v":""}]
[null,null,null,null,null,null,null,null,null,null,null,null,null,null,null,null,null,null,null,null,null,null,null,null,null,null,{"$f":"Calculations!X220","v":""}]
[null,null,null,null,null,null,null,null,null,null,null,null,null,null,null,null,null,null,null,null,null,null,null,null,null,null,{"$f":"Calculations!X221","v":""}]
[null,null,null,null,null,null,null,null,null,null,null,null,null,null,null,null,null,null,null,null,null,null,null,null,null,null,{"$f":"Calculations!X222","v":""}]
[null,null,null,null,null,null,null,null,null,null,null,null,null,null,null,null,null,null,null,null,null,null,null,null,null,null,{"$f":"Calculations!X223","v":""}]
[null,null,null,null,null,null,null,null,null,null,null,null,null,null,null,null,null,null,null,null,null,null,null,null,null,null,{"$f":"Calculations!X224","v":""}]
[null,null,null,null,null,null,null,null,null,null,null,null,null,null,null,null,null,null,null,null,null,null,null,null,null,null,{"$f":"Calculations!X225","v":""}]
[null,null,null,null,null,null,null,null,null,null,null,null,null,null,null,null,null,null,null,null,null,null,null,null,null,null,{"$f":"Calculations!X226","v":""}]
[null,null,null,null,null,null,null,null,null,null,null,null,null,null,null,null,null,null,null,null,null,null,null,null,null,null,{"$f":"Calculations!X227","v":""}]
[null,null,null,null,null,null,null,null,null,null,null,null,null,null,null,null,null,null,null,null,null,null,null,null,null,null,{"$f":"Calculations!X228","v":""}]
[null,null,null,null,null,null,null,null,null,null,null,null,null,null,null,null,null,null,null,null,null,null,null,null,null,null,{"$f":"Calculations!X229","v":""}]
[null,null,null,null,null,null,null,null,null,null,null,null,null,null,null,null,null,null,null,null,null,null,null,null,null,null,{"$f":"Calculations!X230","v":""}]
[null,null,null,null,null,null,null,null,null,null,null,null,null,null,null,null,null,null,null,null,null,null,null,null,null,null,{"$f":"Calculations!X231","v":""}]
[null,null,null,null,null,null,null,null,null,null,null,null,null,null,null,null,null,null,null,null,null,null,null,null,null,null,{"$f":"Calculations!X232","v":""}]
[null,null,null,null,null,null,null,null,null,null,null,null,null,null,null,null,null,null,null,null,null,null,null,null,null,null,{"$f":"Calculations!X233","v":""}]
[null,null,null,null,null,null,null,null,null,null,null,null,null,null,null,null,null,null,null,null,null,null,null,null,null,null,{"$f":"Calculations!X234","v":""}]
[null,null,null,null,null,null,null,null,null,null,null,null,null,null,null,null,null,null,null,null,null,null,null,null,null,null,{"$f":"Calculations!X235","v":""}]
[null,null,null,null,null,null,null,null,null,null,null,null,null,null,null,null,null,null,null,null,null,null,null,null,null,null,{"$f":"Calculations!X236","v":""}]
[null,null,null,null,null,null,null,null,null,null,null,null,null,null,null,null,null,null,null,null,null,null,null,null,null,null,{"$f":"Calculations!X237","v":""}]
[null,null,null,null,null,null,null,null,null,null,null,null,null,null,null,null,null,null,null,null,null,null,null,null,null,null,{"$f":"Calculations!X238","v":""}]
[null,null,null,null,null,null,null,null,null,null,null,null,null,null,null,null,null,null,null,null,null,null,null,null,null,null,{"$f":"Calculations!X239","v":""}]
[null,null,null,null,null,null,null,null,null,null,null,null,null,null,null,null,null,null,null,null,null,null,null,null,null,null,{"$f":"Calculations!X240","v":""}]
[null,null,null,null,null,null,null,null,null,null,null,null,null,null,null,null,null,null,null,null,null,null,null,null,null,null,{"$f":"Calculations!X241","v":""}]
[null,null,null,null,null,null,null,null,null,null,null,null,null,null,null,null,null,null,null,null,null,null,null,null,null,null,{"$f":"Calculations!X242","v":""}]
[null,null,null,null,null,null,null,null,null,null,null,null,null,null,null,null,null,null,null,null,null,null,null,null,null,null,{"$f":"Calculations!X243","v":""}]
[null,null,null,null,null,null,null,null,null,null,null,null,null,null,null,null,null,null,null,null,null,null,null,null,null,null,{"$f":"Calculations!X244","v":""}]
[null,null,null,null,null,null,null,null,null,null,null,null,null,null,null,null,null,null,null,null,null,null,null,null,null,null,{"$f":"Calculations!X245","v":""}]
[null,null,null,null,null,null,null,null,null,null,null,null,null,null,null,null,null,null,null,null,null,null,null,null,null,null,{"$f":"Calculations!X246","v":""}]
[null,null,null,null,null,null,null,null,null,null,null,null,null,null,null,null,null,null,null,null,null,null,null,null,null,null,{"$f":"Calculations!X247","v":""}]
[null,null,null,null,null,null,null,null,null,null,null,null,null,null,null,null,null,null,null,null,null,null,null,null,null,null,{"$f":"Calculations!X248","v":""}]
[null,null,null,null,null,null,null,null,null,null,null,null,null,null,null,null,null,null,null,null,null,null,null,null,null,null,{"$f":"Calculations!X249","v":""}]
[null,null,null,null,null,null,null,null,null,null,null,null,null,null,null,null,null,null,null,null,null,null,null,null,null,null,{"$f":"Calculations!X250","v":""}]
[null,null,null,null,null,null,null,null,null,null,null,null,null,null,null,null,null,null,null,null,null,null,null,null,null,null,{"$f":"Calculations!X251","v":""}]
[null,null,null,null,null,null,null,null,null,null,null,null,null,null,null,null,null,null,null,null,null,null,null,null,null,null,{"$f":"Calculations!X252","v":""}]
[null,null,null,null,null,null,null,null,null,null,null,null,null,null,null,null,null,null,null,null,null,null,null,null,null,null,{"$f":"Calculations!X253","v":""}]
[null,null,null,null,null,null,null,null,null,null,null,null,null,null,null,null,null,null,null,null,null,null,null,null,null,null,{"$f":"Calculations!X254","v":""}]
[null,null,null,null,null,null,null,null,null,null,null,null,null,null,null,null,null,null,null,null,null,null,null,null,null,null,{"$f":"Calculations!X255","v":""}]
[null,null,null,null,null,null,null,null,null,null,null,null,null,null,null,null,null,null,null,null,null,null,null,null,null,null,{"$f":"Calculations!X256","v":""}]
[null,null,null,null,null,null,null,null,null,null,null,null,null,null,null,null,null,null,null,null,null,null,null,null,null,null,{"$f":"Calculations!X257","v":""}]
[null,null,null,null,null,null,null,null,null,null,null,null,null,null,null,null,null,null,null,null,null,null,null,null,null,null,{"$f":"Calculations!X258","v":""}]
[null,null,null,null,null,null,null,null,null,null,null,null,null,null,null,null,null,null,null,null,null,null,null,null,null,null,{"$f":"Calculations!X259","v":""}]
[null,null,null,null,null,null,null,null,null,null,null,null,null,null,null,null,null,null,null,null,null,null,null,null,null,null,{"$f":"Calculations!X260","v":""}]
[null,null,null,null,null,null,null,null,null,null,null,null,null,null,null,null,null,null,null,null,null,null,null,null,null,null,{"$f":"Calculations!X261","v":""}]
[null,null,null,null,null,null,null,null,null,null,null,null,null,null,null,null,null,null,null,null,null,null,null,null,null,null,{"$f":"Calculations!X262","v":""}]
[null,null,null,null,null,null,null,null,null,null,null,null,null,null,null,null,null,null,null,null,null,null,null,null,null,null,{"$f":"Calculations!X263","v":""}]
[null,null,null,null,null,null,null,null,null,null,null,null,null,null,null,null,null,null,null,null,null,null,null,null,null,null,{"$f":"Calculations!X264","v":""}]
[null,null,null,null,null,null,null,null,null,null,null,null,null,null,null,null,null,null,null,null,null,null,null,null,null,null,{"$f":"Calculations!X265","v":""}]
[null,null,null,null,null,null,null,null,null,null,null,null,null,null,null,null,null,null,null,null,null,null,null,null,null,null,{"$f":"Calculations!X266","v":""}]
[null,null,null,null,null,null,null,null,null,null,null,null,null,null,null,null,null,null,null,null,null,null,null,null,null,null,{"$f":"Calculations!X267","v":""}]
[null,null,null,null,null,null,null,null,null,null,null,null,null,null,null,null,null,null,null,null,null,null,null,null,null,null,{"$f":"Calculations!X268","v":""}]
[null,null,null,null,null,null,null,null,null,null,null,null,null,null,null,null,null,null,null,null,null,null,null,null,null,null,{"$f":"Calculations!X269","v":""}]
[null,null,null,null,null,null,null,null,null,null,null,null,null,null,null,null,null,null,null,null,null,null,null,null,null,null,{"$f":"Calculations!X270","v":""}]
[null,null,null,null,null,null,null,null,null,null,null,null,null,null,null,null,null,null,null,null,null,null,null,null,null,null,{"$f":"Calculations!X271","v":""}]
[null,null,null,null,null,null,null,null,null,null,null,null,null,null,null,null,null,null,null,null,null,null,null,null,null,null,{"$f":"Calculations!X272","v":""}]
[null,null,null,null,null,null,null,null,null,null,null,null,null,null,null,null,null,null,null,null,null,null,null,null,null,null,{"$f":"Calculations!X273","v":""}]

{"sheet":"GradGrades","index":6,"n_rows":263,"n_cols":10,"rows_kept":263,"cut":false,"hidden":false,"merged":[]}
["Grade","JD cut","grad cut","conversion",null,"Input only over the blue letters."]
["A+",4.1500000000000004,{"$f":"4-((4-B2)*$D$2)","v":4.2100000000000009},{"$f":"(4-2.6)/(4-3)","v":1.4},null,"The blue data below do not sort."]
[{"$f":"'Grading Scale'!H3","v":"A"},{"$f":"'Grading Scale'!G3","v":3.85},3.79,"factor",null,"Re-enter the blue data below after sorting!!"]
[{"$f":"'Grading Scale'!H4","v":"A-   "},{"$f":"'Grading Scale'!G4","v":3.5},3.3,null,null,null,"only"]
[{"$f":"'Grading Scale'!H5","v":"B+"},{"$f":"'Grading Scale'!G5","v":3.15},2.81,null,null,null,"\"grad\""]
[{"$f":"'Grading Scale'!H6","v":"B    "},{"$f":"'Grading Scale'!G6","v":2.85},2.39,null,null,null,"(without quotes)"]
[{"$f":"'Grading Scale'!H7","v":"B-   "},{"$f":"'Grading Scale'!G7","v":2.5},1.9000000000000004,null,null,null,"will be "]
[{"$f":"'Grading Scale'!H8","v":"C+   "},{"$f":"'Grading Scale'!G8","v":2.15},null,null,null,null,"raised",{"$f":"Scores!W8","v":"Teacher"}]
[{"$f":"'Grading Scale'!H9","v":"C"},{"$f":"'Grading Scale'!G9","v":1.85},null,null,null,null,"to the ",{"$f":"Scores!W9","v":"Semester"}]
[{"$f":"'Grading Scale'!H10","v":"C-   "},null,null,null,null,null,"higher",{"$f":"Scores!W10","v":"Year"}]
[null,null,null,null,null,null,"scale",{"$f":"Scores!W11","v":"Course"}]
[null,null,null,null,null,null,"grad",{"$f":"Scores!W12","v":"final or preliminary"},"Letter"]
["total score","JD ","grad",null,"count?","name","or not?","ID#","Grade"]
[{"$f":"Scores!U14","v":3.7574011537017764},{"$f":"IF(A14<$B$9,$A$10,IF(A14<$B$8,$A$9,IF(A14<$B$7,$A$8,IF(A14<$B$6,$A$7,IF(A14<$B$5,$A$6,IF(A14<$B$4,$A$5,IF(A14<$B$3,$A$4,IF(A14<$B$2,$A$3,$A$2))))))))","v":"A-   "},{"$f":"IF(A14<$C$7,$A$8,IF(A14<$C$6,$A$7,IF(A14<$C$5,$A$6,IF(A14<$C$4,$A$5,IF(A14<$C$3,$A$4,IF(A14<$C$2,$A$3,$A$2))))))","v":"A-   "},{"$f":"IF(G14=\"JD\",IF(E14=\"yes\",\"\",\"check\"),IF(E14=\"yes\",\"BAD?\",\"\"))","v":""},{"$f":"Scores!A14","v":"yes"},{"$f":"Scores!M14","v":"JD"},"JD",{"$f":"Scores!B14","v":123456789},{"$f":"IF(G14=\"grad\",C14,B14)","v":"A-   "},{"$f":"Scores!Y14","v":"BEST"}]
[{"$f":"Scores!U15","v":2.9512994231491119},{"$f":"IF(A15<$B$9,$A$10,IF(A15<$B$8,$A$9,IF(A15<$B$7,$A$8,IF(A15<$B$6,$A$7,IF(A15<$B$5,$A$6,IF(A15<$B$4,$A$5,IF(A15<$B$3,$A$4,IF(A15<$B$2,$A$3,$A$2))))))))","v":"B    "},{"$f":"IF(A15<$C$7,$A$8,IF(A15<$C$6,$A$7,IF(A15<$C$5,$A$6,IF(A15<$C$4,$A$5,IF(A15<$C$3,$A$4,IF(A15<$C$2,$A$3,$A$2))))))","v":"B+"},{"$f":"IF(G15=\"JD\",IF(E15=\"yes\",\"\",\"check\"),IF(E15=\"yes\",\"BAD?\",\"\"))","v":""},{"$f":"Scores!A15","v":"yes"},{"$f":"Scores!M15","v":"JD"},"JD",{"$f":"Scores!B15","v":0},{"$f":"IF(G15=\"grad\",C15,B15)","v":"B    "},{"$f":"Scores!Y15","v":" "}]
[{"$f":"Scores!U16","v":2.9512994231491119},"B    ","B+","",{"$f":"Scores!A16","v":"yes"},{"$f":"Scores!M16","v":"JD"},"JD",{"$f":"Scores!B16","v":0},"B    ",{"$f":"Scores!Y16","v":" "}]
[{"$f":"Scores!U17","v":0},"C-   ","C+   ","check",{"$f":"Scores!A17","v":0},{"$f":"Scores!M17","v":0},"JD",{"$f":"Scores!B17","v":0},"C-   ",{"$f":"Scores!Y17","v":0}]
[{"$f":"Scores!U18","v":0},"C-   ","C+   ","check",{"$f":"Scores!A18","v":0},{"$f":"Scores!M18","v":0},"JD",{"$f":"Scores!B18","v":0},"C-   ",{"$f":"Scores!Y18","v":0}]
[{"$f":"Scores!U19","v":0},"C-   ","C+   ","check",{"$f":"Scores!A19","v":0},{"$f":"Scores!M19","v":0},"JD",{"$f":"Scores!B19","v":0},"C-   ",{"$f":"Scores!Y19","v":0}]
[{"$f":"Scores!U20","v":0},"C-   ","C+   ","check",{"$f":"Scores!A20","v":0},{"$f":"Scores!M20","v":0},"JD",{"$f":"Scores!B20","v":0},"C-   ",{"$f":"Scores!Y20","v":0}]
[{"$f":"Scores!U21","v":0},"C-   ","C+   ","check",{"$f":"Scores!A21","v":0},{"$f":"Scores!M21","v":0},"JD",{"$f":"Scores!B21","v":0},"C-   ",{"$f":"Scores!Y21","v":0}]
[{"$f":"Scores!U22","v":0},"C-   ","C+   ","check",{"$f":"Scores!A22","v":0},{"$f":"Scores!M22","v":0},"JD",{"$f":"Scores!B22","v":0},"C-   ",{"$f":"Scores!Y22","v":0}]
[{"$f":"Scores!U23","v":0},"C-   ","C+   ","check",{"$f":"Scores!A23","v":0},{"$f":"Scores!M23","v":0},"JD",{"$f":"Scores!B23","v":0},"C-   ",{"$f":"Scores!Y23","v":0}]
[{"$f":"Scores!U24","v":0},"C-   ","C+   ","check",{"$f":"Scores!A24","v":0},{"$f":"Scores!M24","v":0},"JD",{"$f":"Scores!B24","v":0},"C-   ",{"$f":"Scores!Y24","v":0}]
[{"$f":"Scores!U25","v":0},"C-   ","C+   ","check",{"$f":"Scores!A25","v":0},{"$f":"Scores!M25","v":0},"JD",{"$f":"Scores!B25","v":0},"C-   ",{"$f":"Scores!Y25","v":0}]
[{"$f":"Scores!U26","v":0},"C-   ","C+   ","check",{"$f":"Scores!A26","v":0},{"$f":"Scores!M26","v":0},"JD",{"$f":"Scores!B26","v":0},"C-   ",{"$f":"Scores!Y26","v":0}]
[{"$f":"Scores!U27","v":0},"C-   ","C+   ","check",{"$f":"Scores!A27","v":0},{"$f":"Scores!M27","v":0},"JD",{"$f":"Scores!B27","v":0},"C-   ",{"$f":"Scores!Y27","v":0}]
[{"$f":"Scores!U28","v":0},"C-   ","C+   ","check",{"$f":"Scores!A28","v":0},{"$f":"Scores!M28","v":0},"JD",{"$f":"Scores!B28","v":0},"C-   ",{"$f":"Scores!Y28","v":0}]
[{"$f":"Scores!U29","v":0},"C-   ","C+   ","check",{"$f":"Scores!A29","v":0},{"$f":"Scores!M29","v":0},"JD",{"$f":"Scores!B29","v":0},"C-   ",{"$f":"Scores!Y29","v":0}]
[{"$f":"Scores!U30","v":0},"C-   ","C+   ","check",{"$f":"Scores!A30","v":0},{"$f":"Scores!M30","v":0},"JD",{"$f":"Scores!B30","v":0},"C-   ",{"$f":"Scores!Y30","v":0}]
[{"$f":"Scores!U31","v":0},"C-   ","C+   ","check",{"$f":"Scores!A31","v":0},{"$f":"Scores!M31","v":0},"JD",{"$f":"Scores!B31","v":0},"C-   ",{"$f":"Scores!Y31","v":0}]
[{"$f":"Scores!U32","v":0},"C-   ","C+   ","check",{"$f":"Scores!A32","v":0},{"$f":"Scores!M32","v":0},"JD",{"$f":"Scores!B32","v":0},"C-   ",{"$f":"Scores!Y32","v":0}]
[{"$f":"Scores!U33","v":0},"C-   ","C+   ","check",{"$f":"Scores!A33","v":0},{"$f":"Scores!M33","v":0},"JD",{"$f":"Scores!B33","v":0},"C-   ",{"$f":"Scores!Y33","v":0}]
[{"$f":"Scores!U34","v":0},"C-   ","C+   ","check",{"$f":"Scores!A34","v":0},{"$f":"Scores!M34","v":0},"JD",{"$f":"Scores!B34","v":0},"C-   ",{"$f":"Scores!Y34","v":0}]
[{"$f":"Scores!U35","v":0},"C-   ","C+   ","check",{"$f":"Scores!A35","v":0},{"$f":"Scores!M35","v":0},"JD",{"$f":"Scores!B35","v":0},"C-   ",{"$f":"Scores!Y35","v":0}]
[{"$f":"Scores!U36","v":0},"C-   ","C+   ","check",{"$f":"Scores!A36","v":0},{"$f":"Scores!M36","v":0},"JD",{"$f":"Scores!B36","v":0},"C-   ",{"$f":"Scores!Y36","v":0}]
[{"$f":"Scores!U37","v":0},"C-   ","C+   ","check",{"$f":"Scores!A37","v":0},{"$f":"Scores!M37","v":0},"JD",{"$f":"Scores!B37","v":0},"C-   ",{"$f":"Scores!Y37","v":0}]
[{"$f":"Scores!U38","v":0},"C-   ","C+   ","check",{"$f":"Scores!A38","v":0},{"$f":"Scores!M38","v":0},"JD",{"$f":"Scores!B38","v":0},"C-   ",{"$f":"Scores!Y38","v":0}]
[{"$f":"Scores!U39","v":0},"C-   ","C+   ","check",{"$f":"Scores!A39","v":0},{"$f":"Scores!M39","v":0},"JD",{"$f":"Scores!B39","v":0},"C-   ",{"$f":"Scores!Y39","v":0}]
[{"$f":"Scores!U40","v":0},"C-   ","C+   ","check",{"$f":"Scores!A40","v":0},{"$f":"Scores!M40","v":0},"JD",{"$f":"Scores!B40","v":0},"C-   ",{"$f":"Scores!Y40","v":0}]
[{"$f":"Scores!U41","v":0},"C-   ","C+   ","check",{"$f":"Scores!A41","v":0},{"$f":"Scores!M41","v":0},"JD",{"$f":"Scores!B41","v":0},"C-   ",{"$f":"Scores!Y41","v":0}]
[{"$f":"Scores!U42","v":0},"C-   ","C+   ","check",{"$f":"Scores!A42","v":0},{"$f":"Scores!M42","v":0},"JD",{"$f":"Scores!B42","v":0},"C-   ",{"$f":"Scores!Y42","v":0}]
[{"$f":"Scores!U43","v":0},"C-   ","C+   ","check",{"$f":"Scores!A43","v":0},{"$f":"Scores!M43","v":0},"JD",{"$f":"Scores!B43","v":0},"C-   ",{"$f":"Scores!Y43","v":0}]
[{"$f":"Scores!U44","v":0},"C-   ","C+   ","check",{"$f":"Scores!A44","v":0},{"$f":"Scores!M44","v":0},"JD",{"$f":"Scores!B44","v":0},"C-   ",{"$f":"Scores!Y44","v":0}]
[{"$f":"Scores!U45","v":0},"C-   ","C+   ","check",{"$f":"Scores!A45","v":0},{"$f":"Scores!M45","v":0},"JD",{"$f":"Scores!B45","v":0},"C-   ",{"$f":"Scores!Y45","v":0}]
[{"$f":"Scores!U46","v":0},"C-   ","C+   ","check",{"$f":"Scores!A46","v":0},{"$f":"Scores!M46","v":0},"JD",{"$f":"Scores!B46","v":0},"C-   ",{"$f":"Scores!Y46","v":0}]
[{"$f":"Scores!U47","v":0},"C-   ","C+   ","check",{"$f":"Scores!A47","v":0},{"$f":"Scores!M47","v":0},"JD",{"$f":"Scores!B47","v":0},"C-   ",{"$f":"Scores!Y47","v":0}]
[{"$f":"Scores!U48","v":0},"C-   ","C+   ","check",{"$f":"Scores!A48","v":0},{"$f":"Scores!M48","v":0},"JD",{"$f":"Scores!B48","v":0},"C-   ",{"$f":"Scores!Y48","v":0}]
[{"$f":"Scores!U49","v":0},"C-   ","C+   ","check",{"$f":"Scores!A49","v":0},{"$f":"Scores!M49","v":0},"JD",{"$f":"Scores!B49","v":0},"C-   ",{"$f":"Scores!Y49","v":0}]
[{"$f":"Scores!U50","v":0},"C-   ","C+   ","check",{"$f":"Scores!A50","v":0},{"$f":"Scores!M50","v":0},"JD",{"$f":"Scores!B50","v":0},"C-   ",{"$f":"Scores!Y50","v":0}]
[{"$f":"Scores!U51","v":0},"C-   ","C+   ","check",{"$f":"Scores!A51","v":0},{"$f":"Scores!M51","v":0},"JD",{"$f":"Scores!B51","v":0},"C-   ",{"$f":"Scores!Y51","v":0}]
[{"$f":"Scores!U52","v":0},"C-   ","C+   ","check",{"$f":"Scores!A52","v":0},{"$f":"Scores!M52","v":0},"JD",{"$f":"Scores!B52","v":0},"C-   ",{"$f":"Scores!Y52","v":0}]
[{"$f":"Scores!U53","v":0},"C-   ","C+   ","check",{"$f":"Scores!A53","v":0},{"$f":"Scores!M53","v":0},"JD",{"$f":"Scores!B53","v":0},"C-   ",{"$f":"Scores!Y53","v":0}]
[{"$f":"Scores!U54","v":0},"C-   ","C+   ","check",{"$f":"Scores!A54","v":0},{"$f":"Scores!M54","v":0},"JD",{"$f":"Scores!B54","v":0},"C-   ",{"$f":"Scores!Y54","v":0}]
[{"$f":"Scores!U55","v":0},"C-   ","C+   ","check",{"$f":"Scores!A55","v":0},{"$f":"Scores!M55","v":0},"JD",{"$f":"Scores!B55","v":0},"C-   ",{"$f":"Scores!Y55","v":0}]
[{"$f":"Scores!U56","v":0},"C-   ","C+   ","check",{"$f":"Scores!A56","v":0},{"$f":"Scores!M56","v":0},"JD",{"$f":"Scores!B56","v":0},"C-   ",{"$f":"Scores!Y56","v":0}]
[{"$f":"Scores!U57","v":0},"C-   ","C+   ","check",{"$f":"Scores!A57","v":0},{"$f":"Scores!M57","v":0},"JD",{"$f":"Scores!B57","v":0},"C-   ",{"$f":"Scores!Y57","v":0}]
[{"$f":"Scores!U58","v":0},"C-   ","C+   ","check",{"$f":"Scores!A58","v":0},{"$f":"Scores!M58","v":0},"JD",{"$f":"Scores!B58","v":0},"C-   ",{"$f":"Scores!Y58","v":0}]
[{"$f":"Scores!U59","v":0},"C-   ","C+   ","check",{"$f":"Scores!A59","v":0},{"$f":"Scores!M59","v":0},"JD",{"$f":"Scores!B59","v":0},"C-   ",{"$f":"Scores!Y59","v":0}]
[{"$f":"Scores!U60","v":0},"C-   ","C+   ","check",{"$f":"Scores!A60","v":0},{"$f":"Scores!M60","v":0},"JD",{"$f":"Scores!B60","v":0},"C-   ",{"$f":"Scores!Y60","v":0}]
[{"$f":"Scores!U61","v":0},"C-   ","C+   ","check",{"$f":"Scores!A61","v":0},{"$f":"Scores!M61","v":0},"JD",{"$f":"Scores!B61","v":0},"C-   ",{"$f":"Scores!Y61","v":0}]
[{"$f":"Scores!U62","v":0},"C-   ","C+   ","check",{"$f":"Scores!A62","v":0},{"$f":"Scores!M62","v":0},"JD",{"$f":"Scores!B62","v":0},"C-   ",{"$f":"Scores!Y62","v":0}]
[{"$f":"Scores!U63","v":0},"C-   ","C+   ","check",{"$f":"Scores!A63","v":0},{"$f":"Scores!M63","v":0},"JD",{"$f":"Scores!B63","v":0},"C-   ",{"$f":"Scores!Y63","v":0}]
[{"$f":"Scores!U64","v":0},"C-   ","C+   ","check",{"$f":"Scores!A64","v":0},{"$f":"Scores!M64","v":0},"JD",{"$f":"Scores!B64","v":0},"C-   ",{"$f":"Scores!Y64","v":0}]
[{"$f":"Scores!U65","v":0},"C-   ","C+   ","check",{"$f":"Scores!A65","v":0},{"$f":"Scores!M65","v":0},"JD",{"$f":"Scores!B65","v":0},"C-   ",{"$f":"Scores!Y65","v":0}]
[{"$f":"Scores!U66","v":0},"C-   ","C+   ","check",{"$f":"Scores!A66","v":0},{"$f":"Scores!M66","v":0},"JD",{"$f":"Scores!B66","v":0},"C-   ",{"$f":"Scores!Y66","v":0}]
[{"$f":"Scores!U67","v":0},"C-   ","C+   ","check",{"$f":"Scores!A67","v":0},{"$f":"Scores!M67","v":0},"JD",{"$f":"Scores!B67","v":0},"C-   ",{"$f":"Scores!Y67","v":0}]
[{"$f":"Scores!U68","v":0},"C-   ","C+   ","check",{"$f":"Scores!A68","v":0},{"$f":"Scores!M68","v":0},"JD",{"$f":"Scores!B68","v":0},"C-   ",{"$f":"Scores!Y68","v":0}]
[{"$f":"Scores!U69","v":0},"C-   ","C+   ","check",{"$f":"Scores!A69","v":0},{"$f":"Scores!M69","v":0},"JD",{"$f":"Scores!B69","v":0},"C-   ",{"$f":"Scores!Y69","v":0}]
[{"$f":"Scores!U70","v":0},"C-   ","C+   ","check",{"$f":"Scores!A70","v":0},{"$f":"Scores!M70","v":0},"JD",{"$f":"Scores!B70","v":0},"C-   ",{"$f":"Scores!Y70","v":0}]
[{"$f":"Scores!U71","v":0},"C-   ","C+   ","check",{"$f":"Scores!A71","v":0},{"$f":"Scores!M71","v":0},"JD",{"$f":"Scores!B71","v":0},"C-   ",{"$f":"Scores!Y71","v":0}]
[{"$f":"Scores!U72","v":0},"C-   ","C+   ","check",{"$f":"Scores!A72","v":0},{"$f":"Scores!M72","v":0},"JD",{"$f":"Scores!B72","v":0},"C-   ",{"$f":"Scores!Y72","v":0}]
[{"$f":"Scores!U73","v":0},"C-   ","C+   ","check",{"$f":"Scores!A73","v":0},{"$f":"Scores!M73","v":0},"JD",{"$f":"Scores!B73","v":0},"C-   ",{"$f":"Scores!Y73","v":0}]
[{"$f":"Scores!U74","v":0},"C-   ","C+   ","check",{"$f":"Scores!A74","v":0},{"$f":"Scores!M74","v":0},"JD",{"$f":"Scores!B74","v":0},"C-   ",{"$f":"Scores!Y74","v":0}]
[{"$f":"Scores!U75","v":0},"C-   ","C+   ","check",{"$f":"Scores!A75","v":0},{"$f":"Scores!M75","v":0},"JD",{"$f":"Scores!B75","v":0},"C-   ",{"$f":"Scores!Y75","v":0}]
[{"$f":"Scores!U76","v":0},"C-   ","C+   ","check",{"$f":"Scores!A76","v":0},{"$f":"Scores!M76","v":0},"JD",{"$f":"Scores!B76","v":0},"C-   ",{"$f":"Scores!Y76","v":0}]
[{"$f":"Scores!U77","v":0},"C-   ","C+   ","check",{"$f":"Scores!A77","v":0},{"$f":"Scores!M77","v":0},"JD",{"$f":"Scores!B77","v":0},"C-   ",{"$f":"Scores!Y77","v":0}]
[{"$f":"Scores!U78","v":0},"C-   ","C+   ","check",{"$f":"Scores!A78","v":0},{"$f":"Scores!M78","v":0},"JD",{"$f":"Scores!B78","v":0},"C-   ",{"$f":"Scores!Y78","v":0}]
[{"$f":"Scores!U79","v":0},{"$f":"IF(A79<$B$9,$A$10,IF(A79<$B$8,$A$9,IF(A79<$B$7,$A$8,IF(A79<$B$6,$A$7,IF(A79<$B$5,$A$6,IF(A79<$B$4,$A$5,IF(A79<$B$3,$A$4,IF(A79<$B$2,$A$3,$A$2))))))))","v":"C-   "},{"$f":"IF(A79<$C$7,$A$8,IF(A79<$C$6,$A$7,IF(A79<$C$5,$A$6,IF(A79<$C$4,$A$5,IF(A79<$C$3,$A$4,IF(A79<$C$2,$A$3,$A$2))))))","v":"C+   "},{"$f":"IF(G79=\"JD\",IF(E79=\"yes\",\"\",\"check\"),IF(E79=\"yes\",\"BAD?\",\"\"))","v":"check"},{"$f":"Scores!A79","v":0},{"$f":"Scores!M79","v":0},"JD",{"$f":"Scores!B79","v":0},{"$f":"IF(G79=\"grad\",C79,B79)","v":"C-   "},{"$f":"Scores!Y79","v":0}]
[{"$f":"Scores!U80","v":0},"C-   ","C+   ","check",{"$f":"Scores!A80","v":0},{"$f":"Scores!M80","v":0},"JD",{"$f":"Scores!B80","v":0},"C-   ",{"$f":"Scores!Y80","v":0}]
[{"$f":"Scores!U81","v":0},"C-   ","C+   ","check",{"$f":"Scores!A81","v":0},{"$f":"Scores!M81","v":0},"JD",{"$f":"Scores!B81","v":0},"C-   ",{"$f":"Scores!Y81","v":0}]
[{"$f":"Scores!U82","v":0},"C-   ","C+   ","check",{"$f":"Scores!A82","v":0},{"$f":"Scores!M82","v":0},"JD",{"$f":"Scores!B82","v":0},"C-   ",{"$f":"Scores!Y82","v":0}]
[{"$f":"Scores!U83","v":0},"C-   ","C+   ","check",{"$f":"Scores!A83","v":0},{"$f":"Scores!M83","v":0},"JD",{"$f":"Scores!B83","v":0},"C-   ",{"$f":"Scores!Y83","v":0}]
[{"$f":"Scores!U84","v":0},"C-   ","C+   ","check",{"$f":"Scores!A84","v":0},{"$f":"Scores!M84","v":0},"JD",{"$f":"Scores!B84","v":0},"C-   ",{"$f":"Scores!Y84","v":0}]
[{"$f":"Scores!U85","v":0},"C-   ","C+   ","check",{"$f":"Scores!A85","v":0},{"$f":"Scores!M85","v":0},"JD",{"$f":"Scores!B85","v":0},"C-   ",{"$f":"Scores!Y85","v":0}]
[{"$f":"Scores!U86","v":0},"C-   ","C+   ","check",{"$f":"Scores!A86","v":0},{"$f":"Scores!M86","v":0},"JD",{"$f":"Scores!B86","v":0},"C-   ",{"$f":"Scores!Y86","v":0}]
[{"$f":"Scores!U87","v":0},"C-   ","C+   ","check",{"$f":"Scores!A87","v":0},{"$f":"Scores!M87","v":0},"JD",{"$f":"Scores!B87","v":0},"C-   ",{"$f":"Scores!Y87","v":0}]
[{"$f":"Scores!U88","v":0},"C-   ","C+   ","check",{"$f":"Scores!A88","v":0},{"$f":"Scores!M88","v":0},"JD",{"$f":"Scores!B88","v":0},"C-   ",{"$f":"Scores!Y88","v":0}]
[{"$f":"Scores!U89","v":0},"C-   ","C+   ","check",{"$f":"Scores!A89","v":0},{"$f":"Scores!M89","v":0},"JD",{"$f":"Scores!B89","v":0},"C-   ",{"$f":"Scores!Y89","v":0}]
[{"$f":"Scores!U90","v":0},"C-   ","C+   ","check",{"$f":"Scores!A90","v":0},{"$f":"Scores!M90","v":0},"JD",{"$f":"Scores!B90","v":0},"C-   ",{"$f":"Scores!Y90","v":0}]
[{"$f":"Scores!U91","v":0},"C-   ","C+   ","check",{"$f":"Scores!A91","v":0},{"$f":"Scores!M91","v":0},"JD",{"$f":"Scores!B91","v":0},"C-   ",{"$f":"Scores!Y91","v":0}]
[{"$f":"Scores!U92","v":0},"C-   ","C+   ","check",{"$f":"Scores!A92","v":0},{"$f":"Scores!M92","v":0},"JD",{"$f":"Scores!B92","v":0},"C-   ",{"$f":"Scores!Y92","v":0}]
[{"$f":"Scores!U93","v":0},"C-   ","C+   ","check",{"$f":"Scores!A93","v":0},{"$f":"Scores!M93","v":0},"JD",{"$f":"Scores!B93","v":0},"C-   ",{"$f":"Scores!Y93","v":0}]
[{"$f":"Scores!U94","v":0},"C-   ","C+   ","check",{"$f":"Scores!A94","v":0},{"$f":"Scores!M94","v":0},"JD",{"$f":"Scores!B94","v":0},"C-   ",{"$f":"Scores!Y94","v":0}]
[{"$f":"Scores!U95","v":0},"C-   ","C+   ","check",{"$f":"Scores!A95","v":0},{"$f":"Scores!M95","v":0},"JD",{"$f":"Scores!B95","v":0},"C-   ",{"$f":"Scores!Y95","v":0}]
[{"$f":"Scores!U96","v":0},"C-   ","C+   ","check",{"$f":"Scores!A96","v":0},{"$f":"Scores!M96","v":0},"JD",{"$f":"Scores!B96","v":0},"C-   ",{"$f":"Scores!Y96","v":0}]
[{"$f":"Scores!U97","v":0},"C-   ","C+   ","check",{"$f":"Scores!A97","v":0},{"$f":"Scores!M97","v":0},"JD",{"$f":"Scores!B97","v":0},"C-   ",{"$f":"Scores!Y97","v":0}]
[{"$f":"Scores!U98","v":0},"C-   ","C+   ","check",{"$f":"Scores!A98","v":0},{"$f":"Scores!M98","v":0},"JD",{"$f":"Scores!B98","v":0},"C-   ",{"$f":"Scores!Y98","v":0}]
[{"$f":"Scores!U99","v":0},"C-   ","C+   ","check",{"$f":"Scores!A99","v":0},{"$f":"Scores!M99","v":0},"JD",{"$f":"Scores!B99","v":0},"C-   ",{"$f":"Scores!Y99","v":0}]
[{"$f":"Scores!U100","v":0},"C-   ","C+   ","check",{"$f":"Scores!A100","v":0},{"$f":"Scores!M100","v":0},"JD",{"$f":"Scores!B100","v":0},"C-   ",{"$f":"Scores!Y100","v":0}]
[{"$f":"Scores!U101","v":0},"C-   ","C+   ","check",{"$f":"Scores!A101","v":0},{"$f":"Scores!M101","v":0},"JD",{"$f":"Scores!B101","v":0},"C-   ",{"$f":"Scores!Y101","v":0}]
[{"$f":"Scores!U102","v":0},"C-   ","C+   ","check",{"$f":"Scores!A102","v":0},{"$f":"Scores!M102","v":0},"JD",{"$f":"Scores!B102","v":0},"C-   ",{"$f":"Scores!Y102","v":0}]
[{"$f":"Scores!U103","v":0},"C-   ","C+   ","check",{"$f":"Scores!A103","v":0},{"$f":"Scores!M103","v":0},"JD",{"$f":"Scores!B103","v":0},"C-   ",{"$f":"Scores!Y103","v":0}]
[{"$f":"Scores!U104","v":0},"C-   ","C+   ","check",{"$f":"Scores!A104","v":0},{"$f":"Scores!M104","v":0},"JD",{"$f":"Scores!B104","v":0},"C-   ",{"$f":"Scores!Y104","v":0}]
[{"$f":"Scores!U105","v":0},"C-   ","C+   ","check",{"$f":"Scores!A105","v":0},{"$f":"Scores!M105","v":0},"JD",{"$f":"Scores!B105","v":0},"C-   ",{"$f":"Scores!Y105","v":0}]
[{"$f":"Scores!U106","v":0},"C-   ","C+   ","check",{"$f":"Scores!A106","v":0},{"$f":"Scores!M106","v":0},"JD",{"$f":"Scores!B106","v":0},"C-   ",{"$f":"Scores!Y106","v":0}]
[{"$f":"Scores!U107","v":0},"C-   ","C+   ","check",{"$f":"Scores!A107","v":0},{"$f":"Scores!M107","v":0},"JD",{"$f":"Scores!B107","v":0},"C-   ",{"$f":"Scores!Y107","v":0}]
[{"$f":"Scores!U108","v":0},"C-   ","C+   ","check",{"$f":"Scores!A108","v":0},{"$f":"Scores!M108","v":0},"JD",{"$f":"Scores!B108","v":0},"C-   ",{"$f":"Scores!Y108","v":0}]
[{"$f":"Scores!U109","v":0},"C-   ","C+   ","check",{"$f":"Scores!A109","v":0},{"$f":"Scores!M109","v":0},"JD",{"$f":"Scores!B109","v":0},"C-   ",{"$f":"Scores!Y109","v":0}]
[{"$f":"Scores!U110","v":0},"C-   ","C+   ","check",{"$f":"Scores!A110","v":0},{"$f":"Scores!M110","v":0},"JD",{"$f":"Scores!B110","v":0},"C-   ",{"$f":"Scores!Y110","v":0}]
[{"$f":"Scores!U111","v":0},"C-   ","C+   ","check",{"$f":"Scores!A111","v":0},{"$f":"Scores!M111","v":0},"JD",{"$f":"Scores!B111","v":0},"C-   ",{"$f":"Scores!Y111","v":0}]
[{"$f":"Scores!U112","v":0},"C-   ","C+   ","check",{"$f":"Scores!A112","v":0},{"$f":"Scores!M112","v":0},"JD",{"$f":"Scores!B112","v":0},"C-   ",{"$f":"Scores!Y112","v":0}]
[{"$f":"Scores!U113","v":0},"C-   ","C+   ","check",{"$f":"Scores!A113","v":0},{"$f":"Scores!M113","v":0},"JD",{"$f":"Scores!B113","v":0},"C-   ",{"$f":"Scores!Y113","v":0}]
[{"$f":"Scores!U114","v":0},"C-   ","C+   ","check",{"$f":"Scores!A114","v":0},{"$f":"Scores!M114","v":0},"JD",{"$f":"Scores!B114","v":0},"C-   ",{"$f":"Scores!Y114","v":0}]
[{"$f":"Scores!U115","v":0},"C-   ","C+   ","check",{"$f":"Scores!A115","v":0},{"$f":"Scores!M115","v":0},"JD",{"$f":"Scores!B115","v":0},"C-   ",{"$f":"Scores!Y115","v":0}]
[{"$f":"Scores!U116","v":0},"C-   ","C+   ","check",{"$f":"Scores!A116","v":0},{"$f":"Scores!M116","v":0},"JD",{"$f":"Scores!B116","v":0},"C-   ",{"$f":"Scores!Y116","v":0}]
[{"$f":"Scores!U117","v":0},"C-   ","C+   ","check",{"$f":"Scores!A117","v":0},{"$f":"Scores!M117","v":0},"JD",{"$f":"Scores!B117","v":0},"C-   ",{"$f":"Scores!Y117","v":0}]
[{"$f":"Scores!U118","v":0},"C-   ","C+   ","check",{"$f":"Scores!A118","v":0},{"$f":"Scores!M118","v":0},"JD",{"$f":"Scores!B118","v":0},"C-   ",{"$f":"Scores!Y118","v":0}]
[{"$f":"Scores!U119","v":0},"C-   ","C+   ","check",{"$f":"Scores!A119","v":0},{"$f":"Scores!M119","v":0},"JD",{"$f":"Scores!B119","v":0},"C-   ",{"$f":"Scores!Y119","v":0}]
[{"$f":"Scores!U120","v":0},"C-   ","C+   ","check",{"$f":"Scores!A120","v":0},{"$f":"Scores!M120","v":0},"JD",{"$f":"Scores!B120","v":0},"C-   ",{"$f":"Scores!Y120","v":0}]
[{"$f":"Scores!U121","v":0},"C-   ","C+   ","check",{"$f":"Scores!A121","v":0},{"$f":"Scores!M121","v":0},"JD",{"$f":"Scores!B121","v":0},"C-   ",{"$f":"Scores!Y121","v":0}]
[{"$f":"Scores!U122","v":0},"C-   ","C+   ","check",{"$f":"Scores!A122","v":0},{"$f":"Scores!M122","v":0},"JD",{"$f":"Scores!B122","v":0},"C-   ",{"$f":"Scores!Y122","v":0}]
[{"$f":"Scores!U123","v":0},"C-   ","C+   ","check",{"$f":"Scores!A123","v":0},{"$f":"Scores!M123","v":0},"JD",{"$f":"Scores!B123","v":0},"C-   ",{"$f":"Scores!Y123","v":0}]
[{"$f":"Scores!U124","v":0},"C-   ","C+   ","check",{"$f":"Scores!A124","v":0},{"$f":"Scores!M124","v":0},"JD",{"$f":"Scores!B124","v":0},"C-   ",{"$f":"Scores!Y124","v":0}]
[{"$f":"Scores!U125","v":0},"C-   ","C+   ","check",{"$f":"Scores!A125","v":0},{"$f":"Scores!M125","v":0},"JD",{"$f":"Scores!B125","v":0},"C-   ",{"$f":"Scores!Y125","v":0}]
[{"$f":"Scores!U126","v":0},"C-   ","C+   ","check",{"$f":"Scores!A126","v":0},{"$f":"Scores!M126","v":0},"JD",{"$f":"Scores!B126","v":0},"C-   ",{"$f":"Scores!Y126","v":0}]
[{"$f":"Scores!U127","v":0},"C-   ","C+   ","check",{"$f":"Scores!A127","v":0},{"$f":"Scores!M127","v":0},"JD",{"$f":"Scores!B127","v":0},"C-   ",{"$f":"Scores!Y127","v":0}]
[{"$f":"Scores!U128","v":0},"C-   ","C+   ","check",{"$f":"Scores!A128","v":0},{"$f":"Scores!M128","v":0},"JD",{"$f":"Scores!B128","v":0},"C-   ",{"$f":"Scores!Y128","v":0}]
[{"$f":"Scores!U129","v":0},"C-   ","C+   ","check",{"$f":"Scores!A129","v":0},{"$f":"Scores!M129","v":0},"JD",{"$f":"Scores!B129","v":0},"C-   ",{"$f":"Scores!Y129","v":0}]
[{"$f":"Scores!U130","v":0},"C-   ","C+   ","check",{"$f":"Scores!A130","v":0},{"$f":"Scores!M130","v":0},"JD",{"$f":"Scores!B130","v":0},"C-   ",{"$f":"Scores!Y130","v":0}]
[{"$f":"Scores!U131","v":0},"C-   ","C+   ","check",{"$f":"Scores!A131","v":0},{"$f":"Scores!M131","v":0},"JD",{"$f":"Scores!B131","v":0},"C-   ",{"$f":"Scores!Y131","v":0}]
[{"$f":"Scores!U132","v":0},"C-   ","C+   ","check",{"$f":"Scores!A132","v":0},{"$f":"Scores!M132","v":0},"JD",{"$f":"Scores!B132","v":0},"C-   ",{"$f":"Scores!Y132","v":0}]
[{"$f":"Scores!U133","v":0},"C-   ","C+   ","check",{"$f":"Scores!A133","v":0},{"$f":"Scores!M133","v":0},"JD",{"$f":"Scores!B133","v":0},"C-   ",{"$f":"Scores!Y133","v":0}]
[{"$f":"Scores!U134","v":0},"C-   ","C+   ","check",{"$f":"Scores!A134","v":0},{"$f":"Scores!M134","v":0},"JD",{"$f":"Scores!B134","v":0},"C-   ",{"$f":"Scores!Y134","v":0}]
[{"$f":"Scores!U135","v":0},"C-   ","C+   ","check",{"$f":"Scores!A135","v":0},{"$f":"Scores!M135","v":0},"JD",{"$f":"Scores!B135","v":0},"C-   ",{"$f":"Scores!Y135","v":0}]
[{"$f":"Scores!U136","v":0},"C-   ","C+   ","check",{"$f":"Scores!A136","v":0},{"$f":"Scores!M136","v":0},"JD",{"$f":"Scores!B136","v":0},"C-   ",{"$f":"Scores!Y136","v":0}]
[{"$f":"Scores!U137","v":0},"C-   ","C+   ","check",{"$f":"Scores!A137","v":0},{"$f":"Scores!M137","v":0},"JD",{"$f":"Scores!B137","v":0},"C-   ",{"$f":"Scores!Y137","v":0}]
[{"$f":"Scores!U138","v":0},"C-   ","C+   ","check",{"$f":"Scores!A138","v":0},{"$f":"Scores!M138","v":0},"JD",{"$f":"Scores!B138","v":0},"C-   ",{"$f":"Scores!Y138","v":0}]
[{"$f":"Scores!U139","v":0},"C-   ","C+   ","check",{"$f":"Scores!A139","v":0},{"$f":"Scores!M139","v":0},"JD",{"$f":"Scores!B139","v":0},"C-   ",{"$f":"Scores!Y139","v":0}]
[{"$f":"Scores!U140","v":0},"C-   ","C+   ","check",{"$f":"Scores!A140","v":0},{"$f":"Scores!M140","v":0},"JD",{"$f":"Scores!B140","v":0},"C-   ",{"$f":"Scores!Y140","v":0}]
[{"$f":"Scores!U141","v":0},"C-   ","C+   ","check",{"$f":"Scores!A141","v":0},{"$f":"Scores!M141","v":0},"JD",{"$f":"Scores!B141","v":0},"C-   ",{"$f":"Scores!Y141","v":0}]
[{"$f":"Scores!U142","v":0},"C-   ","C+   ","check",{"$f":"Scores!A142","v":0},{"$f":"Scores!M142","v":0},"JD",{"$f":"Scores!B142","v":0},"C-   ",{"$f":"Scores!Y142","v":0}]
[{"$f":"Scores!U143","v":0},{"$f":"IF(A143<$B$9,$A$10,IF(A143<$B$8,$A$9,IF(A143<$B$7,$A$8,IF(A143<$B$6,$A$7,IF(A143<$B$5,$A$6,IF(A143<$B$4,$A$5,IF(A143<$B$3,$A$4,IF(A143<$B$2,$A$3,$A$2))))))))","v":"C-   "},{"$f":"IF(A143<$C$7,$A$8,IF(A143<$C$6,$A$7,IF(A143<$C$5,$A$6,IF(A143<$C$4,$A$5,IF(A143<$C$3,$A$4,IF(A143<$C$2,$A$3,$A$2))))))","v":"C+   "},{"$f":"IF(G143=\"JD\",IF(E143=\"yes\",\"\",\"check\"),IF(E143=\"yes\",\"BAD?\",\"\"))","v":"check"},{"$f":"Scores!A143","v":0},{"$f":"Scores!M143","v":0},"JD",{"$f":"Scores!B143","v":0},{"$f":"IF(G143=\"grad\",C143,B143)","v":"C-   "},{"$f":"Scores!Y143","v":0}]
[{"$f":"Scores!U144","v":0},"C-   ","C+   ","check",{"$f":"Scores!A144","v":0},{"$f":"Scores!M144","v":0},"JD",{"$f":"Scores!B144","v":0},"C-   ",{"$f":"Scores!Y144","v":0}]
[{"$f":"Scores!U145","v":0},"C-   ","C+   ","check",{"$f":"Scores!A145","v":0},{"$f":"Scores!M145","v":0},"JD",{"$f":"Scores!B145","v":0},"C-   ",{"$f":"Scores!Y145","v":0}]
[{"$f":"Scores!U146","v":0},"C-   ","C+   ","check",{"$f":"Scores!A146","v":0},{"$f":"Scores!M146","v":0},"JD",{"$f":"Scores!B146","v":0},"C-   ",{"$f":"Scores!Y146","v":0}]
[{"$f":"Scores!U147","v":0},"C-   ","C+   ","check",{"$f":"Scores!A147","v":0},{"$f":"Scores!M147","v":0},"JD",{"$f":"Scores!B147","v":0},"C-   ",{"$f":"Scores!Y147","v":0}]
[{"$f":"Scores!U148","v":0},"C-   ","C+   ","check",{"$f":"Scores!A148","v":0},{"$f":"Scores!M148","v":0},"JD",{"$f":"Scores!B148","v":0},"C-   ",{"$f":"Scores!Y148","v":0}]
[{"$f":"Scores!U149","v":0},"C-   ","C+   ","check",{"$f":"Scores!A149","v":0},{"$f":"Scores!M149","v":0},"JD",{"$f":"Scores!B149","v":0},"C-   ",{"$f":"Scores!Y149","v":0}]
[{"$f":"Scores!U150","v":0},"C-   ","C+   ","check",{"$f":"Scores!A150","v":0},{"$f":"Scores!M150","v":0},"JD",{"$f":"Scores!B150","v":0},"C-   ",{"$f":"Scores!Y150","v":0}]
[{"$f":"Scores!U151","v":0},"C-   ","C+   ","check",{"$f":"Scores!A151","v":0},{"$f":"Scores!M151","v":0},"JD",{"$f":"Scores!B151","v":0},"C-   ",{"$f":"Scores!Y151","v":0}]
[{"$f":"Scores!U152","v":0},"C-   ","C+   ","check",{"$f":"Scores!A152","v":0},{"$f":"Scores!M152","v":0},"JD",{"$f":"Scores!B152","v":0},"C-   ",{"$f":"Scores!Y152","v":0}]
[{"$f":"Scores!U153","v":0},"C-   ","C+   ","check",{"$f":"Scores!A153","v":0},{"$f":"Scores!M153","v":0},"JD",{"$f":"Scores!B153","v":0},"C-   ",{"$f":"Scores!Y153","v":0}]
[{"$f":"Scores!U154","v":0},"C-   ","C+   ","check",{"$f":"Scores!A154","v":0},{"$f":"Scores!M154","v":0},"JD",{"$f":"Scores!B154","v":0},"C-   ",{"$f":"Scores!Y154","v":0}]
[{"$f":"Scores!U155","v":0},"C-   ","C+   ","check",{"$f":"Scores!A155","v":0},{"$f":"Scores!M155","v":0},"JD",{"$f":"Scores!B155","v":0},"C-   ",{"$f":"Scores!Y155","v":0}]
[{"$f":"Scores!U156","v":0},"C-   ","C+   ","check",{"$f":"Scores!A156","v":0},{"$f":"Scores!M156","v":0},"JD",{"$f":"Scores!B156","v":0},"C-   ",{"$f":"Scores!Y156","v":0}]
[{"$f":"Scores!U157","v":0},"C-   ","C+   ","check",{"$f":"Scores!A157","v":0},{"$f":"Scores!M157","v":0},"JD",{"$f":"Scores!B157","v":0},"C-   ",{"$f":"Scores!Y157","v":0}]
[{"$f":"Scores!U158","v":0},"C-   ","C+   ","check",{"$f":"Scores!A158","v":0},{"$f":"Scores!M158","v":0},"JD",{"$f":"Scores!B158","v":0},"C-   ",{"$f":"Scores!Y158","v":0}]
[{"$f":"Scores!U159","v":0},"C-   ","C+   ","check",{"$f":"Scores!A159","v":0},{"$f":"Scores!M159","v":0},"JD",{"$f":"Scores!B159","v":0},"C-   ",{"$f":"Scores!Y159","v":0}]
[{"$f":"Scores!U160","v":0},"C-   ","C+   ","check",{"$f":"Scores!A160","v":0},{"$f":"Scores!M160","v":0},"JD",{"$f":"Scores!B160","v":0},"C-   ",{"$f":"Scores!Y160","v":0}]
[{"$f":"Scores!U161","v":0},"C-   ","C+   ","check",{"$f":"Scores!A161","v":0},{"$f":"Scores!M161","v":0},"JD",{"$f":"Scores!B161","v":0},"C-   ",{"$f":"Scores!Y161","v":0}]
[{"$f":"Scores!U162","v":0},"C-   ","C+   ","check",{"$f":"Scores!A162","v":0},{"$f":"Scores!M162","v":0},"JD",{"$f":"Scores!B162","v":0},"C-   ",{"$f":"Scores!Y162","v":0}]
[{"$f":"Scores!U163","v":0},"C-   ","C+   ","check",{"$f":"Scores!A163","v":0},{"$f":"Scores!M163","v":0},"JD",{"$f":"Scores!B163","v":0},"C-   ",{"$f":"Scores!Y163","v":0}]
[{"$f":"Scores!U164","v":0},"C-   ","C+   ","check",{"$f":"Scores!A164","v":0},{"$f":"Scores!M164","v":0},"JD",{"$f":"Scores!B164","v":0},"C-   ",{"$f":"Scores!Y164","v":0}]
[{"$f":"Scores!U165","v":0},"C-   ","C+   ","check",{"$f":"Scores!A165","v":0},{"$f":"Scores!M165","v":0},"JD",{"$f":"Scores!B165","v":0},"C-   ",{"$f":"Scores!Y165","v":0}]
[{"$f":"Scores!U166","v":0},"C-   ","C+   ","check",{"$f":"Scores!A166","v":0},{"$f":"Scores!M166","v":0},"JD",{"$f":"Scores!B166","v":0},"C-   ",{"$f":"Scores!Y166","v":0}]
[{"$f":"Scores!U167","v":0},"C-   ","C+   ","check",{"$f":"Scores!A167","v":0},{"$f":"Scores!M167","v":0},"JD",{"$f":"Scores!B167","v":0},"C-   ",{"$f":"Scores!Y167","v":0}]
[{"$f":"Scores!U168","v":0},"C-   ","C+   ","check",{"$f":"Scores!A168","v":0},{"$f":"Scores!M168","v":0},"JD",{"$f":"Scores!B168","v":0},"C-   ",{"$f":"Scores!Y168","v":0}]
[{"$f":"Scores!U169","v":0},"C-   ","C+   ","check",{"$f":"Scores!A169","v":0},{"$f":"Scores!M169","v":0},"JD",{"$f":"Scores!B169","v":0},"C-   ",{"$f":"Scores!Y169","v":0}]
[{"$f":"Scores!U170","v":0},"C-   ","C+   ","check",{"$f":"Scores!A170","v":0},{"$f":"Scores!M170","v":0},"JD",{"$f":"Scores!B170","v":0},"C-   ",{"$f":"Scores!Y170","v":0}]
[{"$f":"Scores!U171","v":0},"C-   ","C+   ","check",{"$f":"Scores!A171","v":0},{"$f":"Scores!M171","v":0},"JD",{"$f":"Scores!B171","v":0},"C-   ",{"$f":"Scores!Y171","v":0}]
[{"$f":"Scores!U172","v":0},"C-   ","C+   ","check",{"$f":"Scores!A172","v":0},{"$f":"Scores!M172","v":0},"JD",{"$f":"Scores!B172","v":0},"C-   ",{"$f":"Scores!Y172","v":0}]
[{"$f":"Scores!U173","v":0},"C-   ","C+   ","check",{"$f":"Scores!A173","v":0},{"$f":"Scores!M173","v":0},"JD",{"$f":"Scores!B173","v":0},"C-   ",{"$f":"Scores!Y173","v":0}]
[{"$f":"Scores!U174","v":0},"C-   ","C+   ","check",{"$f":"Scores!A174","v":0},{"$f":"Scores!M174","v":0},"JD",{"$f":"Scores!B174","v":0},"C-   ",{"$f":"Scores!Y174","v":0}]
[{"$f":"Scores!U175","v":0},"C-   ","C+   ","check",{"$f":"Scores!A175","v":0},{"$f":"Scores!M175","v":0},"JD",{"$f":"Scores!B175","v":0},"C-   ",{"$f":"Scores!Y175","v":0}]
[{"$f":"Scores!U176","v":0},"C-   ","C+   ","check",{"$f":"Scores!A176","v":0},{"$f":"Scores!M176","v":0},"JD",{"$f":"Scores!B176","v":0},"C-   ",{"$f":"Scores!Y176","v":0}]
[{"$f":"Scores!U177","v":0},"C-   ","C+   ","check",{"$f":"Scores!A177","v":0},{"$f":"Scores!M177","v":0},"JD",{"$f":"Scores!B177","v":0},"C-   ",{"$f":"Scores!Y177","v":0}]
[{"$f":"Scores!U178","v":0},"C-   ","C+   ","check",{"$f":"Scores!A178","v":0},{"$f":"Scores!M178","v":0},"JD",{"$f":"Scores!B178","v":0},"C-   ",{"$f":"Scores!Y178","v":0}]
[{"$f":"Scores!U179","v":0},"C-   ","C+   ","check",{"$f":"Scores!A179","v":0},{"$f":"Scores!M179","v":0},"JD",{"$f":"Scores!B179","v":0},"C-   ",{"$f":"Scores!Y179","v":0}]
[{"$f":"Scores!U180","v":0},"C-   ","C+   ","check",{"$f":"Scores!A180","v":0},{"$f":"Scores!M180","v":0},"JD",{"$f":"Scores!B180","v":0},"C-   ",{"$f":"Scores!Y180","v":0}]
[{"$f":"Scores!U181","v":0},"C-   ","C+   ","check",{"$f":"Scores!A181","v":0},{"$f":"Scores!M181","v":0},"JD",{"$f":"Scores!B181","v":0},"C-   ",{"$f":"Scores!Y181","v":0}]
[{"$f":"Scores!U182","v":0},"C-   ","C+   ","check",{"$f":"Scores!A182","v":0},{"$f":"Scores!M182","v":0},"JD",{"$f":"Scores!B182","v":0},"C-   ",{"$f":"Scores!Y182","v":0}]
[{"$f":"Scores!U183","v":0},"C-   ","C+   ","check",{"$f":"Scores!A183","v":0},{"$f":"Scores!M183","v":0},"JD",{"$f":"Scores!B183","v":0},"C-   ",{"$f":"Scores!Y183","v":0}]
[{"$f":"Scores!U184","v":0},"C-   ","C+   ","check",{"$f":"Scores!A184","v":0},{"$f":"Scores!M184","v":0},"JD",{"$f":"Scores!B184","v":0},"C-   ",{"$f":"Scores!Y184","v":0}]
[{"$f":"Scores!U185","v":0},"C-   ","C+   ","check",{"$f":"Scores!A185","v":0},{"$f":"Scores!M185","v":0},"JD",{"$f":"Scores!B185","v":0},"C-   ",{"$f":"Scores!Y185","v":0}]
[{"$f":"Scores!U186","v":0},"C-   ","C+   ","check",{"$f":"Scores!A186","v":0},{"$f":"Scores!M186","v":0},"JD",{"$f":"Scores!B186","v":0},"C-   ",{"$f":"Scores!Y186","v":0}]
[{"$f":"Scores!U187","v":0},"C-   ","C+   ","check",{"$f":"Scores!A187","v":0},{"$f":"Scores!M187","v":0},"JD",{"$f":"Scores!B187","v":0},"C-   ",{"$f":"Scores!Y187","v":0}]
[{"$f":"Scores!U188","v":0},"C-   ","C+   ","check",{"$f":"Scores!A188","v":0},{"$f":"Scores!M188","v":0},"JD",{"$f":"Scores!B188","v":0},"C-   ",{"$f":"Scores!Y188","v":0}]
[{"$f":"Scores!U189","v":0},"C-   ","C+   ","check",{"$f":"Scores!A189","v":0},{"$f":"Scores!M189","v":0},"JD",{"$f":"Scores!B189","v":0},"C-   ",{"$f":"Scores!Y189","v":0}]
[{"$f":"Scores!U190","v":0},"C-   ","C+   ","check",{"$f":"Scores!A190","v":0},{"$f":"Scores!M190","v":0},"JD",{"$f":"Scores!B190","v":0},"C-   ",{"$f":"Scores!Y190","v":0}]
[{"$f":"Scores!U191","v":0},"C-   ","C+   ","check",{"$f":"Scores!A191","v":0},{"$f":"Scores!M191","v":0},"JD",{"$f":"Scores!B191","v":0},"C-   ",{"$f":"Scores!Y191","v":0}]
[{"$f":"Scores!U192","v":0},"C-   ","C+   ","check",{"$f":"Scores!A192","v":0},{"$f":"Scores!M192","v":0},"JD",{"$f":"Scores!B192","v":0},"C-   ",{"$f":"Scores!Y192","v":0}]
[{"$f":"Scores!U193","v":0},"C-   ","C+   ","check",{"$f":"Scores!A193","v":0},{"$f":"Scores!M193","v":0},"JD",{"$f":"Scores!B193","v":0},"C-   ",{"$f":"Scores!Y193","v":0}]
[{"$f":"Scores!U194","v":0},"C-   ","C+   ","check",{"$f":"Scores!A194","v":0},{"$f":"Scores!M194","v":0},"JD",{"$f":"Scores!B194","v":0},"C-   ",{"$f":"Scores!Y194","v":0}]
[{"$f":"Scores!U195","v":0},"C-   ","C+   ","check",{"$f":"Scores!A195","v":0},{"$f":"Scores!M195","v":0},"JD",{"$f":"Scores!B195","v":0},"C-   ",{"$f":"Scores!Y195","v":0}]
[{"$f":"Scores!U196","v":0},"C-   ","C+   ","check",{"$f":"Scores!A196","v":0},{"$f":"Scores!M196","v":0},"JD",{"$f":"Scores!B196","v":0},"C-   ",{"$f":"Scores!Y196","v":0}]
[{"$f":"Scores!U197","v":0},"C-   ","C+   ","check",{"$f":"Scores!A197","v":0},{"$f":"Scores!M197","v":0},"JD",{"$f":"Scores!B197","v":0},"C-   ",{"$f":"Scores!Y197","v":0}]
[{"$f":"Scores!U198","v":0},"C-   ","C+   ","check",{"$f":"Scores!A198","v":0},{"$f":"Scores!M198","v":0},"JD",{"$f":"Scores!B198","v":0},"C-   ",{"$f":"Scores!Y198","v":0}]
[{"$f":"Scores!U199","v":0},"C-   ","C+   ","check",{"$f":"Scores!A199","v":0},{"$f":"Scores!M199","v":0},"JD",{"$f":"Scores!B199","v":0},"C-   ",{"$f":"Scores!Y199","v":0}]
[{"$f":"Scores!U200","v":0},"C-   ","C+   ","check",{"$f":"Scores!A200","v":0},{"$f":"Scores!M200","v":0},"JD",{"$f":"Scores!B200","v":0},"C-   ",{"$f":"Scores!Y200","v":0}]
[{"$f":"Scores!U201","v":0},"C-   ","C+   ","check",{"$f":"Scores!A201","v":0},{"$f":"Scores!M201","v":0},"JD",{"$f":"Scores!B201","v":0},"C-   ",{"$f":"Scores!Y201","v":0}]
[{"$f":"Scores!U202","v":0},"C-   ","C+   ","check",{"$f":"Scores!A202","v":0},{"$f":"Scores!M202","v":0},"JD",{"$f":"Scores!B202","v":0},"C-   ",{"$f":"Scores!Y202","v":0}]
[{"$f":"Scores!U203","v":0},"C-   ","C+   ","check",{"$f":"Scores!A203","v":0},{"$f":"Scores!M203","v":0},"JD",{"$f":"Scores!B203","v":0},"C-   ",{"$f":"Scores!Y203","v":0}]
[{"$f":"Scores!U204","v":0},"C-   ","C+   ","check",{"$f":"Scores!A204","v":0},{"$f":"Scores!M204","v":0},"JD",{"$f":"Scores!B204","v":0},"C-   ",{"$f":"Scores!Y204","v":0}]
[{"$f":"Scores!U205","v":0},"C-   ","C+   ","check",{"$f":"Scores!A205","v":0},{"$f":"Scores!M205","v":0},"JD",{"$f":"Scores!B205","v":0},"C-   ",{"$f":"Scores!Y205","v":0}]
[{"$f":"Scores!U206","v":0},"C-   ","C+   ","check",{"$f":"Scores!A206","v":0},{"$f":"Scores!M206","v":0},"JD",{"$f":"Scores!B206","v":0},"C-   ",{"$f":"Scores!Y206","v":0}]
[{"$f":"Scores!U207","v":0},{"$f":"IF(A207<$B$9,$A$10,IF(A207<$B$8,$A$9,IF(A207<$B$7,$A$8,IF(A207<$B$6,$A$7,IF(A207<$B$5,$A$6,IF(A207<$B$4,$A$5,IF(A207<$B$3,$A$4,IF(A207<$B$2,$A$3,$A$2))))))))","v":"C-   "},{"$f":"IF(A207<$C$7,$A$8,IF(A207<$C$6,$A$7,IF(A207<$C$5,$A$6,IF(A207<$C$4,$A$5,IF(A207<$C$3,$A$4,IF(A207<$C$2,$A$3,$A$2))))))","v":"C+   "},{"$f":"IF(G207=\"JD\",IF(E207=\"yes\",\"\",\"check\"),IF(E207=\"yes\",\"BAD?\",\"\"))","v":"check"},{"$f":"Scores!A207","v":0},{"$f":"Scores!M207","v":0},"JD",{"$f":"Scores!B207","v":0},{"$f":"IF(G207=\"grad\",C207,B207)","v":"C-   "},{"$f":"Scores!Y207","v":0}]
[{"$f":"Scores!U208","v":0},"C-   ","C+   ","check",{"$f":"Scores!A208","v":0},{"$f":"Scores!M208","v":0},"JD",{"$f":"Scores!B208","v":0},"C-   ",{"$f":"Scores!Y208","v":0}]
[{"$f":"Scores!U209","v":0},"C-   ","C+   ","check",{"$f":"Scores!A209","v":0},{"$f":"Scores!M209","v":0},"JD",{"$f":"Scores!B209","v":0},"C-   ",{"$f":"Scores!Y209","v":0}]
[{"$f":"Scores!U210","v":0},"C-   ","C+   ","check",{"$f":"Scores!A210","v":0},{"$f":"Scores!M210","v":0},"JD",{"$f":"Scores!B210","v":0},"C-   ",{"$f":"Scores!Y210","v":0}]
[{"$f":"Scores!U211","v":0},"C-   ","C+   ","check",{"$f":"Scores!A211","v":0},{"$f":"Scores!M211","v":0},"JD",{"$f":"Scores!B211","v":0},"C-   ",{"$f":"Scores!Y211","v":0}]
[{"$f":"Scores!U212","v":0},"C-   ","C+   ","check",{"$f":"Scores!A212","v":0},{"$f":"Scores!M212","v":0},"JD",{"$f":"Scores!B212","v":0},"C-   ",{"$f":"Scores!Y212","v":0}]
[{"$f":"Scores!U213","v":0},"C-   ","C+   ","check",{"$f":"Scores!A213","v":0},{"$f":"Scores!M213","v":0},"JD",{"$f":"Scores!B213","v":0},"C-   ",{"$f":"Scores!Y213","v":0}]
[{"$f":"Scores!U214","v":0},"C-   ","C+   ","check",{"$f":"Scores!A214","v":0},{"$f":"Scores!M214","v":0},"JD",{"$f":"Scores!B214","v":0},"C-   ",{"$f":"Scores!Y214","v":0}]
[{"$f":"Scores!U215","v":0},"C-   ","C+   ","check",{"$f":"Scores!A215","v":0},{"$f":"Scores!M215","v":0},"JD",{"$f":"Scores!B215","v":0},"C-   ",{"$f":"Scores!Y215","v":0}]
[{"$f":"Scores!U216","v":0},"C-   ","C+   ","check",{"$f":"Scores!A216","v":0},{"$f":"Scores!M216","v":0},"JD",{"$f":"Scores!B216","v":0},"C-   ",{"$f":"Scores!Y216","v":0}]
[{"$f":"Scores!U217","v":0},"C-   ","C+   ","check",{"$f":"Scores!A217","v":0},{"$f":"Scores!M217","v":0},"JD",{"$f":"Scores!B217","v":0},"C-   ",{"$f":"Scores!Y217","v":0}]
[{"$f":"Scores!U218","v":0},"C-   ","C+   ","check",{"$f":"Scores!A218","v":0},{"$f":"Scores!M218","v":0},"JD",{"$f":"Scores!B218","v":0},"C-   ",{"$f":"Scores!Y218","v":0}]
[{"$f":"Scores!U219","v":0},"C-   ","C+   ","check",{"$f":"Scores!A219","v":0},{"$f":"Scores!M219","v":0},"JD",{"$f":"Scores!B219","v":0},"C-   ",{"$f":"Scores!Y219","v":0}]
[{"$f":"Scores!U220","v":0},"C-   ","C+   ","check",{"$f":"Scores!A220","v":0},{"$f":"Scores!M220","v":0},"JD",{"$f":"Scores!B220","v":0},"C-   ",{"$f":"Scores!Y220","v":0}]
[{"$f":"Scores!U221","v":0},"C-   ","C+   ","check",{"$f":"Scores!A221","v":0},{"$f":"Scores!M221","v":0},"JD",{"$f":"Scores!B221","v":0},"C-   ",{"$f":"Scores!Y221","v":0}]
[{"$f":"Scores!U222","v":0},"C-   ","C+   ","check",{"$f":"Scores!A222","v":0},{"$f":"Scores!M222","v":0},"JD",{"$f":"Scores!B222","v":0},"C-   ",{"$f":"Scores!Y222","v":0}]
[{"$f":"Scores!U223","v":0},"C-   ","C+   ","check",{"$f":"Scores!A223","v":0},{"$f":"Scores!M223","v":0},"JD",{"$f":"Scores!B223","v":0},"C-   ",{"$f":"Scores!Y223","v":0}]
[{"$f":"Scores!U224","v":0},"C-   ","C+   ","check",{"$f":"Scores!A224","v":0},{"$f":"Scores!M224","v":0},"JD",{"$f":"Scores!B224","v":0},"C-   ",{"$f":"Scores!Y224","v":0}]
[{"$f":"Scores!U225","v":0},"C-   ","C+   ","check",{"$f":"Scores!A225","v":0},{"$f":"Scores!M225","v":0},"JD",{"$f":"Scores!B225","v":0},"C-   ",{"$f":"Scores!Y225","v":0}]
[{"$f":"Scores!U226","v":0},"C-   ","C+   ","check",{"$f":"Scores!A226","v":0},{"$f":"Scores!M226","v":0},"JD",{"$f":"Scores!B226","v":0},"C-   ",{"$f":"Scores!Y226","v":0}]
[{"$f":"Scores!U227","v":0},"C-   ","C+   ","check",{"$f":"Scores!A227","v":0},{"$f":"Scores!M227","v":0},"JD",{"$f":"Scores!B227","v":0},"C-   ",{"$f":"Scores!Y227","v":0}]
[{"$f":"Scores!U228","v":0},"C-   ","C+   ","check",{"$f":"Scores!A228","v":0},{"$f":"Scores!M228","v":0},"JD",{"$f":"Scores!B228","v":0},"C-   ",{"$f":"Scores!Y228","v":0}]
[{"$f":"Scores!U229","v":0},"C-   ","C+   ","check",{"$f":"Scores!A229","v":0},{"$f":"Scores!M229","v":0},"JD",{"$f":"Scores!B229","v":0},"C-   ",{"$f":"Scores!Y229","v":0}]
[{"$f":"Scores!U230","v":0},"C-   ","C+   ","check",{"$f":"Scores!A230","v":0},{"$f":"Scores!M230","v":0},"JD",{"$f":"Scores!B230","v":0},"C-   ",{"$f":"Scores!Y230","v":0}]
[{"$f":"Scores!U231","v":0},"C-   ","C+   ","check",{"$f":"Scores!A231","v":0},{"$f":"Scores!M231","v":0},"JD",{"$f":"Scores!B231","v":0},"C-   ",{"$f":"Scores!Y231","v":0}]
[{"$f":"Scores!U232","v":0},"C-   ","C+   ","check",{"$f":"Scores!A232","v":0},{"$f":"Scores!M232","v":0},"JD",{"$f":"Scores!B232","v":0},"C-   ",{"$f":"Scores!Y232","v":0}]
[{"$f":"Scores!U233","v":0},"C-   ","C+   ","check",{"$f":"Scores!A233","v":0},{"$f":"Scores!M233","v":0},"JD",{"$f":"Scores!B233","v":0},"C-   ",{"$f":"Scores!Y233","v":0}]
[{"$f":"Scores!U234","v":0},"C-   ","C+   ","check",{"$f":"Scores!A234","v":0},{"$f":"Scores!M234","v":0},"JD",{"$f":"Scores!B234","v":0},"C-   ",{"$f":"Scores!Y234","v":0}]
[{"$f":"Scores!U235","v":0},"C-   ","C+   ","check",{"$f":"Scores!A235","v":0},{"$f":"Scores!M235","v":0},"JD",{"$f":"Scores!B235","v":0},"C-   ",{"$f":"Scores!Y235","v":0}]
[{"$f":"Scores!U236","v":0},"C-   ","C+   ","check",{"$f":"Scores!A236","v":0},{"$f":"Scores!M236","v":0},"JD",{"$f":"Scores!B236","v":0},"C-   ",{"$f":"Scores!Y236","v":0}]
[{"$f":"Scores!U237","v":0},"C-   ","C+   ","check",{"$f":"Scores!A237","v":0},{"$f":"Scores!M237","v":0},"JD",{"$f":"Scores!B237","v":0},"C-   ",{"$f":"Scores!Y237","v":0}]
[{"$f":"Scores!U238","v":0},"C-   ","C+   ","check",{"$f":"Scores!A238","v":0},{"$f":"Scores!M238","v":0},"JD",{"$f":"Scores!B238","v":0},"C-   ",{"$f":"Scores!Y238","v":0}]
[{"$f":"Scores!U239","v":0},"C-   ","C+   ","check",{"$f":"Scores!A239","v":0},{"$f":"Scores!M239","v":0},"JD",{"$f":"Scores!B239","v":0},"C-   ",{"$f":"Scores!Y239","v":0}]
[{"$f":"Scores!U240","v":0},"C-   ","C+   ","check",{"$f":"Scores!A240","v":0},{"$f":"Scores!M240","v":0},"JD",{"$f":"Scores!B240","v":0},"C-   ",{"$f":"Scores!Y240","v":0}]
[{"$f":"Scores!U241","v":0},"C-   ","C+   ","check",{"$f":"Scores!A241","v":0},{"$f":"Scores!M241","v":0},"JD",{"$f":"Scores!B241","v":0},"C-   ",{"$f":"Scores!Y241","v":0}]
[{"$f":"Scores!U242","v":0},"C-   ","C+   ","check",{"$f":"Scores!A242","v":0},{"$f":"Scores!M242","v":0},"JD",{"$f":"Scores!B242","v":0},"C-   ",{"$f":"Scores!Y242","v":0}]
[{"$f":"Scores!U243","v":0},"C-   ","C+   ","check",{"$f":"Scores!A243","v":0},{"$f":"Scores!M243","v":0},"JD",{"$f":"Scores!B243","v":0},"C-   ",{"$f":"Scores!Y243","v":0}]
[{"$f":"Scores!U244","v":0},"C-   ","C+   ","check",{"$f":"Scores!A244","v":0},{"$f":"Scores!M244","v":0},"JD",{"$f":"Scores!B244","v":0},"C-   ",{"$f":"Scores!Y244","v":0}]
[{"$f":"Scores!U245","v":0},"C-   ","C+   ","check",{"$f":"Scores!A245","v":0},{"$f":"Scores!M245","v":0},"JD",{"$f":"Scores!B245","v":0},"C-   ",{"$f":"Scores!Y245","v":0}]
[{"$f":"Scores!U246","v":0},"C-   ","C+   ","check",{"$f":"Scores!A246","v":0},{"$f":"Scores!M246","v":0},"JD",{"$f":"Scores!B246","v":0},"C-   ",{"$f":"Scores!Y246","v":0}]
[{"$f":"Scores!U247","v":0},"C-   ","C+   ","check",{"$f":"Scores!A247","v":0},{"$f":"Scores!M247","v":0},"JD",{"$f":"Scores!B247","v":0},"C-   ",{"$f":"Scores!Y247","v":0}]
[{"$f":"Scores!U248","v":0},"C-   ","C+   ","check",{"$f":"Scores!A248","v":0},{"$f":"Scores!M248","v":0},"JD",{"$f":"Scores!B248","v":0},"C-   ",{"$f":"Scores!Y248","v":0}]
[{"$f":"Scores!U249","v":0},"C-   ","C+   ","check",{"$f":"Scores!A249","v":0},{"$f":"Scores!M249","v":0},"JD",{"$f":"Scores!B249","v":0},"C-   ",{"$f":"Scores!Y249","v":0}]
[{"$f":"Scores!U250","v":0},"C-   ","C+   ","check",{"$f":"Scores!A250","v":0},{"$f":"Scores!M250","v":0},"JD",{"$f":"Scores!B250","v":0},"C-   ",{"$f":"Scores!Y250","v":0}]
[{"$f":"Scores!U251","v":0},"C-   ","C+   ","check",{"$f":"Scores!A251","v":0},{"$f":"Scores!M251","v":0},"JD",{"$f":"Scores!B251","v":0},"C-   ",{"$f":"Scores!Y251","v":0}]
[{"$f":"Scores!U252","v":0},"C-   ","C+   ","check",{"$f":"Scores!A252","v":0},{"$f":"Scores!M252","v":0},"JD",{"$f":"Scores!B252","v":0},"C-   ",{"$f":"Scores!Y252","v":0}]
[{"$f":"Scores!U253","v":0},"C-   ","C+   ","check",{"$f":"Scores!A253","v":0},{"$f":"Scores!M253","v":0},"JD",{"$f":"Scores!B253","v":0},"C-   ",{"$f":"Scores!Y253","v":0}]
[{"$f":"Scores!U254","v":0},"C-   ","C+   ","check",{"$f":"Scores!A254","v":0},{"$f":"Scores!M254","v":0},"JD",{"$f":"Scores!B254","v":0},"C-   ",{"$f":"Scores!Y254","v":0}]
[{"$f":"Scores!U255","v":0},"C-   ","C+   ","check",{"$f":"Scores!A255","v":0},{"$f":"Scores!M255","v":0},"JD",{"$f":"Scores!B255","v":0},"C-   ",{"$f":"Scores!Y255","v":0}]
[{"$f":"Scores!U256","v":0},"C-   ","C+   ","check",{"$f":"Scores!A256","v":0},{"$f":"Scores!M256","v":0},"JD",{"$f":"Scores!B256","v":0},"C-   ",{"$f":"Scores!Y256","v":0}]
[{"$f":"Scores!U257","v":0},"C-   ","C+   ","check",{"$f":"Scores!A257","v":0},{"$f":"Scores!M257","v":0},"JD",{"$f":"Scores!B257","v":0},"C-   ",{"$f":"Scores!Y257","v":0}]
[{"$f":"Scores!U258","v":0},"C-   ","C+   ","check",{"$f":"Scores!A258","v":0},{"$f":"Scores!M258","v":0},"JD",{"$f":"Scores!B258","v":0},"C-   ",{"$f":"Scores!Y258","v":0}]
[{"$f":"Scores!U259","v":0},"C-   ","C+   ","check",{"$f":"Scores!A259","v":0},{"$f":"Scores!M259","v":0},"JD",{"$f":"Scores!B259","v":0},"C-   ",{"$f":"Scores!Y259","v":0}]
[{"$f":"Scores!U260","v":0},"C-   ","C+   ","check",{"$f":"Scores!A260","v":0},{"$f":"Scores!M260","v":0},"JD",{"$f":"Scores!B260","v":0},"C-   ",{"$f":"Scores!Y260","v":0}]
[{"$f":"Scores!U261","v":0},"C-   ","C+   ","check",{"$f":"Scores!A261","v":0},{"$f":"Scores!M261","v":0},"JD",{"$f":"Scores!B261","v":0},"C-   ",{"$f":"Scores!Y261","v":0}]
[{"$f":"Scores!U262","v":0},"C-   ","C+   ","check",{"$f":"Scores!A262","v":0},{"$f":"Scores!M262","v":0},"JD",{"$f":"Scores!B262","v":0},"C-   ",{"$f":"Scores!Y262","v":0}]
[{"$f":"Scores!U263","v":0},"C-   ","C+   ","check",{"$f":"Scores!A263","v":0},{"$f":"Scores!M263","v":0},"JD",{"$f":"Scores!B263","v":0},"C-   ",{"$f":"Scores!Y263","v":0}]

{"sheet":"Calculations","index":7,"n_rows":273,"n_cols":24,"rows_kept":273,"cut":false,"hidden":false,"merged":[]}
["eZ-Score",null,"Copyright 2002 Jeffrey E. Stake   All rights reserved",null,null,null,null,null,null,null,null,null,null,null,null,null,"Target","mean",{"$f":"Scores!U5","v":3.22},{"$f":"DCOUNTA($A$22:$V$273,21,'Grading Scale'!A2:B3)","v":0},{"$f":"'Grading Scale'!C3","v":"A"},{"$f":"T1/$T$16","v":0}]
["Version 4.02 xls",null,null,null,null,null,null,null,null,null,null,null,null,null,null,null,"Target","stdev",{"$f":"Scores!U6","v":0.38},{"$f":"DCOUNTA($A$22:$V$273,21,'Grading Scale'!A4:B5)","v":1},{"$f":"'Grading Scale'!C5","v":"A-   "},0.33333333333333331]
[null,null,null,null,null,null,null,null,null,null,null,null,null,null,null,null,null,null,null,{"$f":"DCOUNTA($A$22:$V$273,21,'Grading Scale'!A6:B7)","v":0},{"$f":"'Grading Scale'!C7","v":"B+"},0]
["      ",null,null,null,null,null,null,null,null,null,null,null,null,null,null,null,null,null,null,{"$f":"DCOUNTA($A$22:$V$273,21,'Grading Scale'!A8:B9)","v":2},{"$f":"'Grading Scale'!C9","v":"B    "},0.66666666666666663]
[null,null,null,null,null,null,null,null,null,null,null,null,null,null,null,null,null,null,null,{"$f":"DCOUNTA($A$22:$V$273,21,'Grading Scale'!A10:B11)","v":0},{"$f":"'Grading Scale'!C11","v":"B-   "},0]
[null,null,null,null,null,null,null,null,null,null,null,null,null,null,null,null,null,null,null,{"$f":"DCOUNTA($A$22:$V$273,21,'Grading Scale'!A12:B13)","v":0},{"$f":"'Grading Scale'!C13","v":"C+   "},0]
[null,null,null,null,null,null,null,null,null,null,null,null,null,null,null,null,null,null,null,{"$f":"DCOUNTA($A$22:$V$273,21,'Grading Scale'!D2:E3)","v":0},{"$f":"'Grading Scale'!F3","v":"C"},0]
[null,null,null,null,null,null,null,null,null,null,null,null,null,null,null,null,null,null,null,{"$f":"DCOUNTA($A$22:$V$273,21,'Grading Scale'!D4:E5)","v":0},{"$f":"'Grading Scale'!F5","v":"C-   "},0]
[null,null,null,null,null,null,null,null,null,null,null,null,null,null,null,null,null,null,null,{"$f":"DCOUNTA($A$22:$V$273,21,'Grading Scale'!D6:E7)","v":0},{"$f":"'Grading Scale'!F7","v":"D+   "},0]
[null,null,null,{"$f":"IF(M11>0,\"WARNING, you gave some scores no weight\",\" \")","v":" "},null,null,null,null,null,null,null,null,null,null,null,null,null,null,null,{"$f":"DCOUNTA($A$22:$V$273,21,'Grading Scale'!D8:E9)","v":0},{"$f":"'Grading Scale'!F9","v":"D    "},0]
[null,null,{"$f":"IF(C21=0,IF(C14>0,1,0),0)","v":0},0,0,0,0,0,0,0,0,0,{"$f":"SUM(C11:L11)","v":0},null,null,null,null,null,null,{"$f":"DCOUNTA($A$22:$V$273,21,'Grading Scale'!D10:E11)","v":0},{"$f":"'Grading Scale'!F11","v":"F    "},0]
[{"$f":"Scores!A6","v":"yes"},"the   Z-score  method  of weighting subscores",null,null,null,null,null,null,{"$f":"IF(A12=\"yes\",\"IS being used.\",\"is NOT being used.\")","v":"IS being used."},null,null,null,null,null,null,null,null,null,null,{"$f":"DCOUNTA($A$22:$V$273,21,'Grading Scale'!D12:E13)","v":0},{"$f":"'Grading Scale'!F13","v":"F-?"},0]
[null,"SUBSCORE DATA"]
[null,"stdev",{"$f":"DSTDEVP($A$22:$L$273,('Grading Scale'!N1+1),'Grading Scale'!$F$1:$F$2)","v":0.47140452079103168},{"$f":"DSTDEVP($A$22:$L$273,('Grading Scale'!O1+1),'Grading Scale'!$F$1:$F$2)","v":0},{"$f":"DSTDEVP($A$22:$L$273,('Grading Scale'!P1+1),'Grading Scale'!$F$1:$F$2)","v":0},{"$f":"DSTDEVP($A$22:$L$273,('Grading Scale'!Q1+1),'Grading Scale'!$F$1:$F$2)","v":0},{"$f":"DSTDEVP($A$22:$L$273,('Grading Scale'!R1+1),'Grading Scale'!$F$1:$F$2)","v":0},{"$f":"DSTDEVP($A$22:$L$273,('Grading Scale'!S1+1),'Grading Scale'!$F$1:$F$2)","v":0},{"$f":"DSTDEVP($A$22:$L$273,('Grading Scale'!T1+1),'Grading Scale'!$F$1:$F$2)","v":0},{"$f":"DSTDEVP($A$22:$L$273,('Grading Scale'!U1+1),'Grading Scale'!$F$1:$F$2)","v":0},{"$f":"DSTDEVP($A$22:$L$273,('Grading Scale'!V1+1),'Grading Scale'!$F$1:$F$2)","v":0},{"$f":"DSTDEVP($A$22:$L$273,('Grading Scale'!W1+1),'Grading Scale'!$F$1:$F$2)","v":0},null,null,null,null,null,null,null,{"$f":"S19","v":3.2333333333333329},"= Average"]
[null,"high",{"$f":"DMAX($A$22:$L$273,('Grading Scale'!N$1+1),'Grading Scale'!$F$1:$F$2)","v":1},{"$f":"DMAX($A$22:$L$273,('Grading Scale'!O$1+1),'Grading Scale'!$F$1:$F$2)","v":0},{"$f":"DMAX($A$22:$L$273,('Grading Scale'!P$1+1),'Grading Scale'!$F$1:$F$2)","v":0},{"$f":"DMAX($A$22:$L$273,('Grading Scale'!Q$1+1),'Grading Scale'!$F$1:$F$2)","v":0},{"$f":"DMAX($A$22:$L$273,('Grading Scale'!R$1+1),'Grading Scale'!$F$1:$F$2)","v":0},{"$f":"DMAX($A$22:$L$273,('Grading Scale'!S$1+1),'Grading Scale'!$F$1:$F$2)","v":0},{"$f":"DMAX($A$22:$L$273,('Grading Scale'!T$1+1),'Grading Scale'!$F$1:$F$2)","v":0},{"$f":"DMAX($A$22:$L$273,('Grading Scale'!U$1+1),'Grading Scale'!$F$1:$F$2)","v":0},{"$f":"DMAX($A$22:$L$273,('Grading Scale'!V$1+1),'Grading Scale'!$F$1:$F$2)","v":0},{"$f":"DMAX($A$22:$L$273,('Grading Scale'!W$1+1),'Grading Scale'!$F$1:$F$2)","v":0},null,"extra","extra",null,null,null,null,{"$f":"S16","v":0.32998316455372523},"= Std. Dev."]
[null,"low",{"$f":"DMIN($A$22:$L$273,('Grading Scale'!N$1+1),'Grading Scale'!$F$1:$F$2)","v":0},{"$f":"DMIN($A$22:$L$273,('Grading Scale'!O$1+1),'Grading Scale'!$F$1:$F$2)","v":0},{"$f":"DMIN($A$22:$L$273,('Grading Scale'!P$1+1),'Grading Scale'!$F$1:$F$2)","v":0},{"$f":"DMIN($A$22:$L$273,('Grading Scale'!Q$1+1),'Grading Scale'!$F$1:$F$2)","v":0},{"$f":"DMIN($A$22:$L$273,('Grading Scale'!R$1+1),'Grading Scale'!$F$1:$F$2)","v":0},{"$f":"DMIN($A$22:$L$273,('Grading Scale'!S$1+1),'Grading Scale'!$F$1:$F$2)","v":0},{"$f":"DMIN($A$22:$L$273,('Grading Scale'!T$1+1),'Grading Scale'!$F$1:$F$2)","v":0},{"$f":"DMIN($A$22:$L$273,('Grading Scale'!U$1+1),'Grading Scale'!$F$1:$F$2)","v":0},{"$f":"DMIN($A$22:$L$273,('Grading Scale'!V$1+1),'Grading Scale'!$F$1:$F$2)","v":0},{"$f":"DMIN($A$22:$L$273,('Grading Scale'!W$1+1),'Grading Scale'!$F$1:$F$2)","v":0},null,"credit","credit",{"$f":"DSTDEVP($A$22:P$273,('Grading Scale'!AA$1+1),'Grading Scale'!$F$1:$F$2)","v":1},"stdev",{"$f":"DSTDEVP($A$22:R$273,('Grading Scale'!AC$1+1),'Grading Scale'!$F$1:$F$2)","v":0.38000000000000178},{"$f":"DSTDEVP($A$22:S$273,('Grading Scale'!AD$1+1),'Grading Scale'!$F$1:$F$2)","v":0.32998316455372523},{"$f":"SUM(T1:T12)","v":3},"= Class Size"]
[null,"mean",{"$f":"IF($A$12=\"yes\",DAVERAGE($A$22:$L$273,('Grading Scale'!N$1+1),'Grading Scale'!$F$1:$F$2),0)","v":0.33333333333333331},{"$f":"IF($A$12=\"yes\",DAVERAGE($A$22:$L$273,('Grading Scale'!O$1+1),'Grading Scale'!$F$1:$F$2),0)","v":0},{"$f":"IF($A$12=\"yes\",DAVERAGE($A$22:$L$273,('Grading Scale'!P$1+1),'Grading Scale'!$F$1:$F$2),0)","v":0},{"$f":"IF($A$12=\"yes\",DAVERAGE($A$22:$L$273,('Grading Scale'!Q$1+1),'Grading Scale'!$F$1:$F$2),0)","v":0},{"$f":"IF($A$12=\"yes\",DAVERAGE($A$22:$L$273,('Grading Scale'!R$1+1),'Grading Scale'!$F$1:$F$2),0)","v":0},{"$f":"IF($A$12=\"yes\",DAVERAGE($A$22:$L$273,('Grading Scale'!S$1+1),'Grading Scale'!$F$1:$F$2),0)","v":0},{"$f":"IF($A$12=\"yes\",DAVERAGE($A$22:$L$273,('Grading Scale'!T$1+1),'Grading Scale'!$F$1:$F$2),0)","v":0},{"$f":"IF($A$12=\"yes\",DAVERAGE($A$22:$L$273,('Grading Scale'!U$1+1),'Grading Scale'!$F$1:$F$2),0)","v":0},{"$f":"IF($A$12=\"yes\",DAVERAGE($A$22:$L$273,('Grading Scale'!V$1+1),'Grading Scale'!$F$1:$F$2),0)","v":0},{"$f":"IF($A$12=\"yes\",DAVERAGE($A$22:$L$273,('Grading Scale'!W$1+1),'Grading Scale'!$F$1:$F$2),0)","v":0},null,"factor","factor",{"$f":"DMAX($A$22:P$273,('Grading Scale'!AA$1+1),'Grading Scale'!$F$1:$F$2)","v":1.4142135623730951},"max",{"$f":"DMAX($A$22:R$273,('Grading Scale'!AC$1+1),'Grading Scale'!$F$1:$F$2)","v":3.7574011537017764},{"$f":"DMAX($A$22:S$273,('Grading Scale'!AD$1+1),'Grading Scale'!$F$1:$F$2)","v":3.7}]
[null,"% of grade",{"$f":"C21/$M$21","v":1},0,0,0,0,0,0,0,0,0,null,"for","for",{"$f":"DMIN($A$22:P$273,('Grading Scale'!AA$1+1),'Grading Scale'!$F$1:$F$2)","v":-0.70710678118654746},"min",{"$f":"DMIN($A$22:R$273,('Grading Scale'!AC$1+1),'Grading Scale'!$F$1:$F$2)","v":2.9512994231491119},{"$f":"DMIN($A$22:S$273,('Grading Scale'!AD$1+1),'Grading Scale'!$F$1:$F$2)","v":3}]
[null,"factor",{"$f":"IF(C21=0,0,IF($A$12=\"yes\",+C21/C14,+C21))","v":2.1213203435596424},0,0,0,0,0,0,0,0,0,"sum","attend","talk",{"$f":"DAVERAGE($A$22:P$273,('Grading Scale'!AA$1+1),'Grading Scale'!$F$1:$F$2)","v":7.4014868308343765E-17},"mean",{"$f":"DAVERAGE($A$22:R$273,('Grading Scale'!AC$1+1),'Grading Scale'!$F$1:$F$2)","v":3.22},{"$f":"DAVERAGE($A$22:S$273,('Grading Scale'!AD$1+1),'Grading Scale'!$F$1:$F$2)","v":3.2333333333333329}]
["score possible (optional)",null,{"$f":"Scores!C11","v":0},{"$f":"Scores!D11","v":0},{"$f":"Scores!E11","v":0},{"$f":"Scores!F11","v":0},{"$f":"Scores!G11","v":0},{"$f":"Scores!H11","v":0},{"$f":"Scores!I11","v":0},{"$f":"Scores!J11","v":0},{"$f":"Scores!K11","v":0},{"$f":"Scores!L11","v":0},{"$f":"SUM(C20:L20)","v":0}]
[null,"Weight =",{"$f":"Scores!C12","v":1},{"$f":"Scores!D12","v":0},{"$f":"Scores!E12","v":0},{"$f":"Scores!F12","v":0},{"$f":"Scores!G12","v":0},{"$f":"Scores!H12","v":0},{"$f":"Scores!I12","v":0},{"$f":"Scores!J12","v":0},{"$f":"Scores!K12","v":0},{"$f":"Scores!L12","v":0},{"$f":"SUM(C21:L21)","v":1},{"$f":"Scores!N12","v":0},{"$f":"Scores!O12","v":0},"exam","exam"]
["Count?","ID#","part1","part2","part3","part4","part5","part6","part7","part8","part9","part10","name","attend","  talk"," sum","score","total","grade","ID","letter grade"]
[{"$f":"Scores!A14","v":"yes"},{"$f":"Scores!B14","v":123456789},{"$f":"Scores!C14","v":1},{"$f":"Scores!D14","v":0},{"$f":"Scores!E14","v":0},{"$f":"Scores!F14","v":0},{"$f":"Scores!G14","v":0},{"$f":"Scores!H14","v":0},{"$f":"Scores!I14","v":0},{"$f":"Scores!J14","v":0},{"$f":"Scores!K14","v":0},{"$f":"Scores!L14","v":0},{"$f":"Scores!M14","v":"JD"},{"$f":"Scores!N14","v":0},{"$f":"Scores!O14","v":0},{"$f":"(C23-$C$17)*$C$19+(D23-$D$17)*$D$19+(E23-$E$17)*$E$19+(F23-$F$17)*$F$19+(G23-$G$17)*$G$19+(H23-$H$17)*$H$19+(I23-$I$17)*$I$19+(J23-$J$17)*$J$19+(K23-$K$17)*$K$19+(L23-$L$17)*$L$19","v":1.4142135623730951},{"$f":"(((P23-$P$19)/$P$16)*$S$2)+$S$1","v":3.7574011537017764},{"$f":"Q23+(N23*N$21)+(O23*O$21)","v":3.7574011537017764},{"$f":"IF(R23<'Grading Scale'!G$8,IF(R23<'Grading Scale'!G$13,'Grading Scale'!E$13,IF(R23<'Grading Scale'!G$12,'Grading Scale'!E$11,IF(R23<'Grading Scale'!G$11,'Grading Scale'!E$9,IF(R23<'Grading Scale'!G$10,'Grading Scale'!E$7,IF(R23<'Grading Scale'!G$9,'Grading Scale'!E$5,'Grading Scale'!E$3))))),IF(R23<'Grading Scale'!G$7,'Grading Scale'!B$13,IF(R23<'Grading Scale'!G$6,'Grading Scale'!B$11,IF(R23<'Grading Scale'!G$5,'Grading Scale'!B$9,IF(R23<'Grading Scale'!G$4,'Grading Scale'!B$7,IF(R23<'Grading Scale'!G$3,'Grading Scale'!B$5,'Grading Scale'!B$3))))))","v":3.7},{"$f":"Scores!B14","v":123456789},{"$f":"IF(S23>='Grading Scale'!B$13,IF(S23='Grading Scale'!B$3,'Grading Scale'!C$3,IF(S23='Grading Scale'!B$5,'Grading Scale'!C$5,IF(S23='Grading Scale'!B$7,'Grading Scale'!C$7,IF(S23='Grading Scale'!B$9,'Grading Scale'!C$9,IF(S23='Grading Scale'!B$11,'Grading Scale'!C$11,'Grading Scale'!C$13))))),IF(S23='Grading Scale'!E$3,'Grading Scale'!F$3,IF(S23='Grading Scale'!E$5,'Grading Scale'!F$5,IF(S23='Grading Scale'!E$7,'Grading Scale'!F$7,IF(S23='Grading Scale'!E$9,'Grading Scale'!F$9,IF(S23='Grading Scale'!E$11,'Grading Scale'!F$11,'Grading Scale'!F$13))))))","v":"A-   "},{"$f":"IF(P23=$P$17,\"BEST\",\" \")","v":"BEST"},null,{"$f":"IF(W23=0,\"\",IF(W23=S23,\"\",IF(W23>S23,\"dropped\",\"increased\")))","v":""}]
[{"$f":"Scores!A15","v":"yes"},{"$f":"Scores!B15","v":0},{"$f":"Scores!C15","v":0},{"$f":"Scores!D15","v":0},{"$f":"Scores!E15","v":0},{"$f":"Scores!F15","v":0},{"$f":"Scores!G15","v":0},{"$f":"Scores!H15","v":0},{"$f":"Scores!I15","v":0},{"$f":"Scores!J15","v":0},{"$f":"Scores!K15","v":0},{"$f":"Scores!L15","v":0},{"$f":"Scores!M15","v":"JD"},{"$f":"Scores!N15","v":0},{"$f":"Scores!O15","v":0},-0.70710678118654746,2.9512994231491119,2.9512994231491119,{"$f":"IF(R24<'Grading Scale'!G$8,IF(R24<'Grading Scale'!G$13,'Grading Scale'!E$13,IF(R24<'Grading Scale'!G$12,'Grading Scale'!E$11,IF(R24<'Grading Scale'!G$11,'Grading Scale'!E$9,IF(R24<'Grading Scale'!G$10,'Grading Scale'!E$7,IF(R24<'Grading Scale'!G$9,'Grading Scale'!E$5,'Grading Scale'!E$3))))),IF(R24<'Grading Scale'!G$7,'Grading Scale'!B$13,IF(R24<'Grading Scale'!G$6,'Grading Scale'!B$11,IF(R24<'Grading Scale'!G$5,'Grading Scale'!B$9,IF(R24<'Grading Scale'!G$4,'Grading Scale'!B$7,IF(R24<'Grading Scale'!G$3,'Grading Scale'!B$5,'Grading Scale'!B$3))))))","v":3},{"$f":"Scores!B15","v":0},{"$f":"IF(S24>='Grading Scale'!B$13,IF(S24='Grading Scale'!B$3,'Grading Scale'!C$3,IF(S24='Grading Scale'!B$5,'Grading Scale'!C$5,IF(S24='Grading Scale'!B$7,'Grading Scale'!C$7,IF(S24='Grading Scale'!B$9,'Grading Scale'!C$9,IF(S24='Grading Scale'!B$11,'Grading Scale'!C$11,'Grading Scale'!C$13))))),IF(S24='Grading Scale'!E$3,'Grading Scale'!F$3,IF(S24='Grading Scale'!E$5,'Grading Scale'!F$5,IF(S24='Grading Scale'!E$7,'Grading Scale'!F$7,IF(S24='Grading Scale'!E$9,'Grading Scale'!F$9,IF(S24='Grading Scale'!E$11,'Grading Scale'!F$11,'Grading Scale'!F$13))))))","v":"B    "}," ",null,""]
[{"$f":"Scores!A16","v":"yes"},{"$f":"Scores!B16","v":0},{"$f":"Scores!C16","v":0},{"$f":"Scores!D16","v":0},{"$f":"Scores!E16","v":0},{"$f":"Scores!F16","v":0},{"$f":"Scores!G16","v":0},{"$f":"Scores!H16","v":0},{"$f":"Scores!I16","v":0},{"$f":"Scores!J16","v":0},{"$f":"Scores!K16","v":0},{"$f":"Scores!L16","v":0},{"$f":"Scores!M16","v":"JD"},{"$f":"Scores!N16","v":0},{"$f":"Scores!O16","v":0},-0.70710678118654746,2.9512994231491119,2.9512994231491119,{"$f":"IF(R25<'Grading Scale'!G$8,IF(R25<'Grading Scale'!G$13,'Grading Scale'!E$13,IF(R25<'Grading Scale'!G$12,'Grading Scale'!E$11,IF(R25<'Grading Scale'!G$11,'Grading Scale'!E$9,IF(R25<'Grading Scale'!G$10,'Grading Scale'!E$7,IF(R25<'Grading Scale'!G$9,'Grading Scale'!E$5,'Grading Scale'!E$3))))),IF(R25<'Grading Scale'!G$7,'Grading Scale'!B$13,IF(R25<'Grading Scale'!G$6,'Grading Scale'!B$11,IF(R25<'Grading Scale'!G$5,'Grading Scale'!B$9,IF(R25<'Grading Scale'!G$4,'Grading Scale'!B$7,IF(R25<'Grading Scale'!G$3,'Grading Scale'!B$5,'Grading Scale'!B$3))))))","v":3},{"$f":"Scores!B16","v":0},{"$f":"IF(S25>='Grading Scale'!B$13,IF(S25='Grading Scale'!B$3,'Grading Scale'!C$3,IF(S25='Grading Scale'!B$5,'Grading Scale'!C$5,IF(S25='Grading Scale'!B$7,'Grading Scale'!C$7,IF(S25='Grading Scale'!B$9,'Grading Scale'!C$9,IF(S25='Grading Scale'!B$11,'Grading Scale'!C$11,'Grading Scale'!C$13))))),IF(S25='Grading Scale'!E$3,'Grading Scale'!F$3,IF(S25='Grading Scale'!E$5,'Grading Scale'!F$5,IF(S25='Grading Scale'!E$7,'Grading Scale'!F$7,IF(S25='Grading Scale'!E$9,'Grading Scale'!F$9,IF(S25='Grading Scale'!E$11,'Grading Scale'!F$11,'Grading Scale'!F$13))))))","v":"B    "}," ",null,""]
[{"$f":"Scores!A17","v":0},{"$f":"Scores!B17","v":0},{"$f":"Scores!C17","v":0},{"$f":"Scores!D17","v":0},{"$f":"Scores!E17","v":0},{"$f":"Scores!F17","v":0},{"$f":"Scores!G17","v":0},{"$f":"Scores!H17","v":0},{"$f":"Scores!I17","v":0},{"$f":"Scores!J17","v":0},{"$f":"Scores!K17","v":0},{"$f":"Scores!L17","v":0},{"$f":"Scores!M17","v":0},{"$f":"Scores!N17","v":0},{"$f":"Scores!O17","v":0},-0.70710678118654746,2.9512994231491119,2.9512994231491119,{"$f":"IF(R26<'Grading Scale'!G$8,IF(R26<'Grading Scale'!G$13,'Grading Scale'!E$13,IF(R26<'Grading Scale'!G$12,'Grading Scale'!E$11,IF(R26<'Grading Scale'!G$11,'Grading Scale'!E$9,IF(R26<'Grading Scale'!G$10,'Grading Scale'!E$7,IF(R26<'Grading Scale'!G$9,'Grading Scale'!E$5,'Grading Scale'!E$3))))),IF(R26<'Grading Scale'!G$7,'Grading Scale'!B$13,IF(R26<'Grading Scale'!G$6,'Grading Scale'!B$11,IF(R26<'Grading Scale'!G$5,'Grading Scale'!B$9,IF(R26<'Grading Scale'!G$4,'Grading Scale'!B$7,IF(R26<'Grading Scale'!G$3,'Grading Scale'!B$5,'Grading Scale'!B$3))))))","v":3},{"$f":"Scores!B17","v":0},{"$f":"IF(S26>='Grading Scale'!B$13,IF(S26='Grading Scale'!B$3,'Grading Scale'!C$3,IF(S26='Grading Scale'!B$5,'Grading Scale'!C$5,IF(S26='Grading Scale'!B$7,'Grading Scale'!C$7,IF(S26='Grading Scale'!B$9,'Grading Scale'!C$9,IF(S26='Grading Scale'!B$11,'Grading Scale'!C$11,'Grading Scale'!C$13))))),IF(S26='Grading Scale'!E$3,'Grading Scale'!F$3,IF(S26='Grading Scale'!E$5,'Grading Scale'!F$5,IF(S26='Grading Scale'!E$7,'Grading Scale'!F$7,IF(S26='Grading Scale'!E$9,'Grading Scale'!F$9,IF(S26='Grading Scale'!E$11,'Grading Scale'!F$11,'Grading Scale'!F$13))))))","v":"B    "}," ",null,""]
[{"$f":"Scores!A18","v":0},{"$f":"Scores!B18","v":0},{"$f":"Scores!C18","v":0},{"$f":"Scores!D18","v":0},{"$f":"Scores!E18","v":0},{"$f":"Scores!F18","v":0},{"$f":"Scores!G18","v":0},{"$f":"Scores!H18","v":0},{"$f":"Scores!I18","v":0},{"$f":"Scores!J18","v":0},{"$f":"Scores!K18","v":0},{"$f":"Scores!L18","v":0},{"$f":"Scores!M18","v":0},{"$f":"Scores!N18","v":0},{"$f":"Scores!O18","v":0},-0.70710678118654746,2.9512994231491119,2.9512994231491119,{"$f":"IF(R27<'Grading Scale'!G$8,IF(R27<'Grading Scale'!G$13,'Grading Scale'!E$13,IF(R27<'Grading Scale'!G$12,'Grading Scale'!E$11,IF(R27<'Grading Scale'!G$11,'Grading Scale'!E$9,IF(R27<'Grading Scale'!G$10,'Grading Scale'!E$7,IF(R27<'Grading Scale'!G$9,'Grading Scale'!E$5,'Grading Scale'!E$3))))),IF(R27<'Grading Scale'!G$7,'Grading Scale'!B$13,IF(R27<'Grading Scale'!G$6,'Grading Scale'!B$11,IF(R27<'Grading Scale'!G$5,'Grading Scale'!B$9,IF(R27<'Grading Scale'!G$4,'Grading Scale'!B$7,IF(R27<'Grading Scale'!G$3,'Grading Scale'!B$5,'Grading Scale'!B$3))))))","v":3},{"$f":"Scores!B18","v":0},{"$f":"IF(S27>='Grading Scale'!B$13,IF(S27='Grading Scale'!B$3,'Grading Scale'!C$3,IF(S27='Grading Scale'!B$5,'Grading Scale'!C$5,IF(S27='Grading Scale'!B$7,'Grading Scale'!C$7,IF(S27='Grading Scale'!B$9,'Grading Scale'!C$9,IF(S27='Grading Scale'!B$11,'Grading Scale'!C$11,'Grading Scale'!C$13))))),IF(S27='Grading Scale'!E$3,'Grading Scale'!F$3,IF(S27='Grading Scale'!E$5,'Grading Scale'!F$5,IF(S27='Grading Scale'!E$7,'Grading Scale'!F$7,IF(S27='Grading Scale'!E$9,'Grading Scale'!F$9,IF(S27='Grading Scale'!E$11,'Grading Scale'!F$11,'Grading Scale'!F$13))))))","v":"B    "}," ",null,""]
[{"$f":"Scores!A19","v":0},{"$f":"Scores!B19","v":0},{"$f":"Scores!C19","v":0},{"$f":"Scores!D19","v":0},{"$f":"Scores!E19","v":0},{"$f":"Scores!F19","v":0},{"$f":"Scores!G19","v":0},{"$f":"Scores!H19","v":0},{"$f":"Scores!I19","v":0},{"$f":"Scores!J19","v":0},{"$f":"Scores!K19","v":0},{"$f":"Scores!L19","v":0},{"$f":"Scores!M19","v":0},{"$f":"Scores!N19","v":0},{"$f":"Scores!O19","v":0},-0.70710678118654746,2.9512994231491119,2.9512994231491119,{"$f":"IF(R28<'Grading Scale'!G$8,IF(R28<'Grading Scale'!G$13,'Grading Scale'!E$13,IF(R28<'Grading Scale'!G$12,'Grading Scale'!E$11,IF(R28<'Grading Scale'!G$11,'Grading Scale'!E$9,IF(R28<'Grading Scale'!G$10,'Grading Scale'!E$7,IF(R28<'Grading Scale'!G$9,'Grading Scale'!E$5,'Grading Scale'!E$3))))),IF(R28<'Grading Scale'!G$7,'Grading Scale'!B$13,IF(R28<'Grading Scale'!G$6,'Grading Scale'!B$11,IF(R28<'Grading Scale'!G$5,'Grading Scale'!B$9,IF(R28<'Grading Scale'!G$4,'Grading Scale'!B$7,IF(R28<'Grading Scale'!G$3,'Grading Scale'!B$5,'Grading Scale'!B$3))))))","v":3},{"$f":"Scores!B19","v":0},{"$f":"IF(S28>='Grading Scale'!B$13,IF(S28='Grading Scale'!B$3,'Grading Scale'!C$3,IF(S28='Grading Scale'!B$5,'Grading Scale'!C$5,IF(S28='Grading Scale'!B$7,'Grading Scale'!C$7,IF(S28='Grading Scale'!B$9,'Grading Scale'!C$9,IF(S28='Grading Scale'!B$11,'Grading Scale'!C$11,'Grading Scale'!C$13))))),IF(S28='Grading Scale'!E$3,'Grading Scale'!F$3,IF(S28='Grading Scale'!E$5,'Grading Scale'!F$5,IF(S28='Grading Scale'!E$7,'Grading Scale'!F$7,IF(S28='Grading Scale'!E$9,'Grading Scale'!F$9,IF(S28='Grading Scale'!E$11,'Grading Scale'!F$11,'Grading Scale'!F$13))))))","v":"B    "}," ",null,""]
[{"$f":"Scores!A20","v":0},{"$f":"Scores!B20","v":0},{"$f":"Scores!C20","v":0},{"$f":"Scores!D20","v":0},{"$f":"Scores!E20","v":0},{"$f":"Scores!F20","v":0},{"$f":"Scores!G20","v":0},{"$f":"Scores!H20","v":0},{"$f":"Scores!I20","v":0},{"$f":"Scores!J20","v":0},{"$f":"Scores!K20","v":0},{"$f":"Scores!L20","v":0},{"$f":"Scores!M20","v":0},{"$f":"Scores!N20","v":0},{"$f":"Scores!O20","v":0},-0.70710678118654746,2.9512994231491119,2.9512994231491119,{"$f":"IF(R29<'Grading Scale'!G$8,IF(R29<'Grading Scale'!G$13,'Grading Scale'!E$13,IF(R29<'Grading Scale'!G$12,'Grading Scale'!E$11,IF(R29<'Grading Scale'!G$11,'Grading Scale'!E$9,IF(R29<'Grading Scale'!G$10,'Grading Scale'!E$7,IF(R29<'Grading Scale'!G$9,'Grading Scale'!E$5,'Grading Scale'!E$3))))),IF(R29<'Grading Scale'!G$7,'Grading Scale'!B$13,IF(R29<'Grading Scale'!G$6,'Grading Scale'!B$11,IF(R29<'Grading Scale'!G$5,'Grading Scale'!B$9,IF(R29<'Grading Scale'!G$4,'Grading Scale'!B$7,IF(R29<'Grading Scale'!G$3,'Grading Scale'!B$5,'Grading Scale'!B$3))))))","v":3},{"$f":"Scores!B20","v":0},{"$f":"IF(S29>='Grading Scale'!B$13,IF(S29='Grading Scale'!B$3,'Grading Scale'!C$3,IF(S29='Grading Scale'!B$5,'Grading Scale'!C$5,IF(S29='Grading Scale'!B$7,'Grading Scale'!C$7,IF(S29='Grading Scale'!B$9,'Grading Scale'!C$9,IF(S29='Grading Scale'!B$11,'Grading Scale'!C$11,'Grading Scale'!C$13))))),IF(S29='Grading Scale'!E$3,'Grading Scale'!F$3,IF(S29='Grading Scale'!E$5,'Grading Scale'!F$5,IF(S29='Grading Scale'!E$7,'Grading Scale'!F$7,IF(S29='Grading Scale'!E$9,'Grading Scale'!F$9,IF(S29='Grading Scale'!E$11,'Grading Scale'!F$11,'Grading Scale'!F$13))))))","v":"B    "}," ",null,""]
[{"$f":"Scores!A21","v":0},{"$f":"Scores!B21","v":0},{"$f":"Scores!C21","v":0},{"$f":"Scores!D21","v":0},{"$f":"Scores!E21","v":0},{"$f":"Scores!F21","v":0},{"$f":"Scores!G21","v":0},{"$f":"Scores!H21","v":0},{"$f":"Scores!I21","v":0},{"$f":"Scores!J21","v":0},{"$f":"Scores!K21","v":0},{"$f":"Scores!L21","v":0},{"$f":"Scores!M21","v":0},{"$f":"Scores!N21","v":0},{"$f":"Scores!O21","v":0},-0.70710678118654746,2.9512994231491119,2.9512994231491119,{"$f":"IF(R30<'Grading Scale'!G$8,IF(R30<'Grading Scale'!G$13,'Grading Scale'!E$13,IF(R30<'Grading Scale'!G$12,'Grading Scale'!E$11,IF(R30<'Grading Scale'!G$11,'Grading Scale'!E$9,IF(R30<'Grading Scale'!G$10,'Grading Scale'!E$7,IF(R30<'Grading Scale'!G$9,'Grading Scale'!E$5,'Grading Scale'!E$3))))),IF(R30<'Grading Scale'!G$7,'Grading Scale'!B$13,IF(R30<'Grading Scale'!G$6,'Grading Scale'!B$11,IF(R30<'Grading Scale'!G$5,'Grading Scale'!B$9,IF(R30<'Grading Scale'!G$4,'Grading Scale'!B$7,IF(R30<'Grading Scale'!G$3,'Grading Scale'!B$5,'Grading Scale'!B$3))))))","v":3},{"$f":"Scores!B21","v":0},{"$f":"IF(S30>='Grading Scale'!B$13,IF(S30='Grading Scale'!B$3,'Grading Scale'!C$3,IF(S30='Grading Scale'!B$5,'Grading Scale'!C$5,IF(S30='Grading Scale'!B$7,'Grading Scale'!C$7,IF(S30='Grading Scale'!B$9,'Grading Scale'!C$9,IF(S30='Grading Scale'!B$11,'Grading Scale'!C$11,'Grading Scale'!C$13))))),IF(S30='Grading Scale'!E$3,'Grading Scale'!F$3,IF(S30='Grading Scale'!E$5,'Grading Scale'!F$5,IF(S30='Grading Scale'!E$7,'Grading Scale'!F$7,IF(S30='Grading Scale'!E$9,'Grading Scale'!F$9,IF(S30='Grading Scale'!E$11,'Grading Scale'!F$11,'Grading Scale'!F$13))))))","v":"B    "}," ",null,""]
[{"$f":"Scores!A22","v":0},{"$f":"Scores!B22","v":0},{"$f":"Scores!C22","v":0},{"$f":"Scores!D22","v":0},{"$f":"Scores!E22","v":0},{"$f":"Scores!F22","v":0},{"$f":"Scores!G22","v":0},{"$f":"Scores!H22","v":0},{"$f":"Scores!I22","v":0},{"$f":"Scores!J22","v":0},{"$f":"Scores!K22","v":0},{"$f":"Scores!L22","v":0},{"$f":"Scores!M22","v":0},{"$f":"Scores!N22","v":0},{"$f":"Scores!O22","v":0},-0.70710678118654746,2.9512994231491119,2.9512994231491119,{"$f":"IF(R31<'Grading Scale'!G$8,IF(R31<'Grading Scale'!G$13,'Grading Scale'!E$13,IF(R31<'Grading Scale'!G$12,'Grading Scale'!E$11,IF(R31<'Grading Scale'!G$11,'Grading Scale'!E$9,IF(R31<'Grading Scale'!G$10,'Grading Scale'!E$7,IF(R31<'Grading Scale'!G$9,'Grading Scale'!E$5,'Grading Scale'!E$3))))),IF(R31<'Grading Scale'!G$7,'Grading Scale'!B$13,IF(R31<'Grading Scale'!G$6,'Grading Scale'!B$11,IF(R31<'Grading Scale'!G$5,'Grading Scale'!B$9,IF(R31<'Grading Scale'!G$4,'Grading Scale'!B$7,IF(R31<'Grading Scale'!G$3,'Grading Scale'!B$5,'Grading Scale'!B$3))))))","v":3},{"$f":"Scores!B22","v":0},{"$f":"IF(S31>='Grading Scale'!B$13,IF(S31='Grading Scale'!B$3,'Grading Scale'!C$3,IF(S31='Grading Scale'!B$5,'Grading Scale'!C$5,IF(S31='Grading Scale'!B$7,'Grading Scale'!C$7,IF(S31='Grading Scale'!B$9,'Grading Scale'!C$9,IF(S31='Grading Scale'!B$11,'Grading Scale'!C$11,'Grading Scale'!C$13))))),IF(S31='Grading Scale'!E$3,'Grading Scale'!F$3,IF(S31='Grading Scale'!E$5,'Grading Scale'!F$5,IF(S31='Grading Scale'!E$7,'Grading Scale'!F$7,IF(S31='Grading Scale'!E$9,'Grading Scale'!F$9,IF(S31='Grading Scale'!E$11,'Grading Scale'!F$11,'Grading Scale'!F$13))))))","v":"B    "}," ",null,""]
[{"$f":"Scores!A23","v":0},{"$f":"Scores!B23","v":0},{"$f":"Scores!C23","v":0},{"$f":"Scores!D23","v":0},{"$f":"Scores!E23","v":0},{"$f":"Scores!F23","v":0},{"$f":"Scores!G23","v":0},{"$f":"Scores!H23","v":0},{"$f":"Scores!I23","v":0},{"$f":"Scores!J23","v":0},{"$f":"Scores!K23","v":0},{"$f":"Scores!L23","v":0},{"$f":"Scores!M23","v":0},{"$f":"Scores!N23","v":0},{"$f":"Scores!O23","v":0},-0.70710678118654746,2.9512994231491119,2.9512994231491119,{"$f":"IF(R32<'Grading Scale'!G$8,IF(R32<'Grading Scale'!G$13,'Grading Scale'!E$13,IF(R32<'Grading Scale'!G$12,'Grading Scale'!E$11,IF(R32<'Grading Scale'!G$11,'Grading Scale'!E$9,IF(R32<'Grading Scale'!G$10,'Grading Scale'!E$7,IF(R32<'Grading Scale'!G$9,'Grading Scale'!E$5,'Grading Scale'!E$3))))),IF(R32<'Grading Scale'!G$7,'Grading Scale'!B$13,IF(R32<'Grading Scale'!G$6,'Grading Scale'!B$11,IF(R32<'Grading Scale'!G$5,'Grading Scale'!B$9,IF(R32<'Grading Scale'!G$4,'Grading Scale'!B$7,IF(R32<'Grading Scale'!G$3,'Grading Scale'!B$5,'Grading Scale'!B$3))))))","v":3},{"$f":"Scores!B23","v":0},{"$f":"IF(S32>='Grading Scale'!B$13,IF(S32='Grading Scale'!B$3,'Grading Scale'!C$3,IF(S32='Grading Scale'!B$5,'Grading Scale'!C$5,IF(S32='Grading Scale'!B$7,'Grading Scale'!C$7,IF(S32='Grading Scale'!B$9,'Grading Scale'!C$9,IF(S32='Grading Scale'!B$11,'Grading Scale'!C$11,'Grading Scale'!C$13))))),IF(S32='Grading Scale'!E$3,'Grading Scale'!F$3,IF(S32='Grading Scale'!E$5,'Grading Scale'!F$5,IF(S32='Grading Scale'!E$7,'Grading Scale'!F$7,IF(S32='Grading Scale'!E$9,'Grading Scale'!F$9,IF(S32='Grading Scale'!E$11,'Grading Scale'!F$11,'Grading Scale'!F$13))))))","v":"B    "}," ",null,""]
[{"$f":"Scores!A24","v":0},{"$f":"Scores!B24","v":0},{"$f":"Scores!C24","v":0},{"$f":"Scores!D24","v":0},{"$f":"Scores!E24","v":0},{"$f":"Scores!F24","v":0},{"$f":"Scores!G24","v":0},{"$f":"Scores!H24","v":0},{"$f":"Scores!I24","v":0},{"$f":"Scores!J24","v":0},{"$f":"Scores!K24","v":0},{"$f":"Scores!L24","v":0},{"$f":"Scores!M24","v":0},{"$f":"Scores!N24","v":0},{"$f":"Scores!O24","v":0},-0.70710678118654746,2.9512994231491119,2.9512994231491119,{"$f":"IF(R33<'Grading Scale'!G$8,IF(R33<'Grading Scale'!G$13,'Grading Scale'!E$13,IF(R33<'Grading Scale'!G$12,'Grading Scale'!E$11,IF(R33<'Grading Scale'!G$11,'Grading Scale'!E$9,IF(R33<'Grading Scale'!G$10,'Grading Scale'!E$7,IF(R33<'Grading Scale'!G$9,'Grading Scale'!E$5,'Grading Scale'!E$3))))),IF(R33<'Grading Scale'!G$7,'Grading Scale'!B$13,IF(R33<'Grading Scale'!G$6,'Grading Scale'!B$11,IF(R33<'Grading Scale'!G$5,'Grading Scale'!B$9,IF(R33<'Grading Scale'!G$4,'Grading Scale'!B$7,IF(R33<'Grading Scale'!G$3,'Grading Scale'!B$5,'Grading Scale'!B$3))))))","v":3},{"$f":"Scores!B24","v":0},{"$f":"IF(S33>='Grading Scale'!B$13,IF(S33='Grading Scale'!B$3,'Grading Scale'!C$3,IF(S33='Grading Scale'!B$5,'Grading Scale'!C$5,IF(S33='Grading Scale'!B$7,'Grading Scale'!C$7,IF(S33='Grading Scale'!B$9,'Grading Scale'!C$9,IF(S33='Grading Scale'!B$11,'Grading Scale'!C$11,'Grading Scale'!C$13))))),IF(S33='Grading Scale'!E$3,'Grading Scale'!F$3,IF(S33='Grading Scale'!E$5,'Grading Scale'!F$5,IF(S33='Grading Scale'!E$7,'Grading Scale'!F$7,IF(S33='Grading Scale'!E$9,'Grading Scale'!F$9,IF(S33='Grading Scale'!E$11,'Grading Scale'!F$11,'Grading Scale'!F$13))))))","v":"B    "}," ",null,""]
[{"$f":"Scores!A25","v":0},{"$f":"Scores!B25","v":0},{"$f":"Scores!C25","v":0},{"$f":"Scores!D25","v":0},{"$f":"Scores!E25","v":0},{"$f":"Scores!F25","v":0},{"$f":"Scores!G25","v":0},{"$f":"Scores!H25","v":0},{"$f":"Scores!I25","v":0},{"$f":"Scores!J25","v":0},{"$f":"Scores!K25","v":0},{"$f":"Scores!L25","v":0},{"$f":"Scores!M25","v":0},{"$f":"Scores!N25","v":0},{"$f":"Scores!O25","v":0},-0.70710678118654746,2.9512994231491119,2.9512994231491119,{"$f":"IF(R34<'Grading Scale'!G$8,IF(R34<'Grading Scale'!G$13,'Grading Scale'!E$13,IF(R34<'Grading Scale'!G$12,'Grading Scale'!E$11,IF(R34<'Grading Scale'!G$11,'Grading Scale'!E$9,IF(R34<'Grading Scale'!G$10,'Grading Scale'!E$7,IF(R34<'Grading Scale'!G$9,'Grading Scale'!E$5,'Grading Scale'!E$3))))),IF(R34<'Grading Scale'!G$7,'Grading Scale'!B$13,IF(R34<'Grading Scale'!G$6,'Grading Scale'!B$11,IF(R34<'Grading Scale'!G$5,'Grading Scale'!B$9,IF(R34<'Grading Scale'!G$4,'Grading Scale'!B$7,IF(R34<'Grading Scale'!G$3,'Grading Scale'!B$5,'Grading Scale'!B$3))))))","v":3},{"$f":"Scores!B25","v":0},{"$f":"IF(S34>='Grading Scale'!B$13,IF(S34='Grading Scale'!B$3,'Grading Scale'!C$3,IF(S34='Grading Scale'!B$5,'Grading Scale'!C$5,IF(S34='Grading Scale'!B$7,'Grading Scale'!C$7,IF(S34='Grading Scale'!B$9,'Grading Scale'!C$9,IF(S34='Grading Scale'!B$11,'Grading Scale'!C$11,'Grading Scale'!C$13))))),IF(S34='Grading Scale'!E$3,'Grading Scale'!F$3,IF(S34='Grading Scale'!E$5,'Grading Scale'!F$5,IF(S34='Grading Scale'!E$7,'Grading Scale'!F$7,IF(S34='Grading Scale'!E$9,'Grading Scale'!F$9,IF(S34='Grading Scale'!E$11,'Grading Scale'!F$11,'Grading Scale'!F$13))))))","v":"B    "}," ",null,""]
[{"$f":"Scores!A26","v":0},{"$f":"Scores!B26","v":0},{"$f":"Scores!C26","v":0},{"$f":"Scores!D26","v":0},{"$f":"Scores!E26","v":0},{"$f":"Scores!F26","v":0},{"$f":"Scores!G26","v":0},{"$f":"Scores!H26","v":0},{"$f":"Scores!I26","v":0},{"$f":"Scores!J26","v":0},{"$f":"Scores!K26","v":0},{"$f":"Scores!L26","v":0},{"$f":"Scores!M26","v":0},{"$f":"Scores!N26","v":0},{"$f":"Scores!O26","v":0},-0.70710678118654746,2.9512994231491119,2.9512994231491119,{"$f":"IF(R35<'Grading Scale'!G$8,IF(R35<'Grading Scale'!G$13,'Grading Scale'!E$13,IF(R35<'Grading Scale'!G$12,'Grading Scale'!E$11,IF(R35<'Grading Scale'!G$11,'Grading Scale'!E$9,IF(R35<'Grading Scale'!G$10,'Grading Scale'!E$7,IF(R35<'Grading Scale'!G$9,'Grading Scale'!E$5,'Grading Scale'!E$3))))),IF(R35<'Grading Scale'!G$7,'Grading Scale'!B$13,IF(R35<'Grading Scale'!G$6,'Grading Scale'!B$11,IF(R35<'Grading Scale'!G$5,'Grading Scale'!B$9,IF(R35<'Grading Scale'!G$4,'Grading Scale'!B$7,IF(R35<'Grading Scale'!G$3,'Grading Scale'!B$5,'Grading Scale'!B$3))))))","v":3},{"$f":"Scores!B26","v":0},{"$f":"IF(S35>='Grading Scale'!B$13,IF(S35='Grading Scale'!B$3,'Grading Scale'!C$3,IF(S35='Grading Scale'!B$5,'Grading Scale'!C$5,IF(S35='Grading Scale'!B$7,'Grading Scale'!C$7,IF(S35='Grading Scale'!B$9,'Grading Scale'!C$9,IF(S35='Grading Scale'!B$11,'Grading Scale'!C$11,'Grading Scale'!C$13))))),IF(S35='Grading Scale'!E$3,'Grading Scale'!F$3,IF(S35='Grading Scale'!E$5,'Grading Scale'!F$5,IF(S35='Grading Scale'!E$7,'Grading Scale'!F$7,IF(S35='Grading Scale'!E$9,'Grading Scale'!F$9,IF(S35='Grading Scale'!E$11,'Grading Scale'!F$11,'Grading Scale'!F$13))))))","v":"B    "}," ",null,""]
[{"$f":"Scores!A27","v":0},{"$f":"Scores!B27","v":0},{"$f":"Scores!C27","v":0},{"$f":"Scores!D27","v":0},{"$f":"Scores!E27","v":0},{"$f":"Scores!F27","v":0},{"$f":"Scores!G27","v":0},{"$f":"Scores!H27","v":0},{"$f":"Scores!I27","v":0},{"$f":"Scores!J27","v":0},{"$f":"Scores!K27","v":0},{"$f":"Scores!L27","v":0},{"$f":"Scores!M27","v":0},{"$f":"Scores!N27","v":0},{"$f":"Scores!O27","v":0},-0.70710678118654746,2.9512994231491119,2.9512994231491119,{"$f":"IF(R36<'Grading Scale'!G$8,IF(R36<'Grading Scale'!G$13,'Grading Scale'!E$13,IF(R36<'Grading Scale'!G$12,'Grading Scale'!E$11,IF(R36<'Grading Scale'!G$11,'Grading Scale'!E$9,IF(R36<'Grading Scale'!G$10,'Grading Scale'!E$7,IF(R36<'Grading Scale'!G$9,'Grading Scale'!E$5,'Grading Scale'!E$3))))),IF(R36<'Grading Scale'!G$7,'Grading Scale'!B$13,IF(R36<'Grading Scale'!G$6,'Grading Scale'!B$11,IF(R36<'Grading Scale'!G$5,'Grading Scale'!B$9,IF(R36<'Grading Scale'!G$4,'Grading Scale'!B$7,IF(R36<'Grading Scale'!G$3,'Grading Scale'!B$5,'Grading Scale'!B$3))))))","v":3},{"$f":"Scores!B27","v":0},{"$f":"IF(S36>='Grading Scale'!B$13,IF(S36='Grading Scale'!B$3,'Grading Scale'!C$3,IF(S36='Grading Scale'!B$5,'Grading Scale'!C$5,IF(S36='Grading Scale'!B$7,'Grading Scale'!C$7,IF(S36='Grading Scale'!B$9,'Grading Scale'!C$9,IF(S36='Grading Scale'!B$11,'Grading Scale'!C$11,'Grading Scale'!C$13))))),IF(S36='Grading Scale'!E$3,'Grading Scale'!F$3,IF(S36='Grading Scale'!E$5,'Grading Scale'!F$5,IF(S36='Grading Scale'!E$7,'Grading Scale'!F$7,IF(S36='Grading Scale'!E$9,'Grading Scale'!F$9,IF(S36='Grading Scale'!E$11,'Grading Scale'!F$11,'Grading Scale'!F$13))))))","v":"B    "}," ",null,""]
[{"$f":"Scores!A28","v":0},{"$f":"Scores!B28","v":0},{"$f":"Scores!C28","v":0},{"$f":"Scores!D28","v":0},{"$f":"Scores!E28","v":0},{"$f":"Scores!F28","v":0},{"$f":"Scores!G28","v":0},{"$f":"Scores!H28","v":0},{"$f":"Scores!I28","v":0},{"$f":"Scores!J28","v":0},{"$f":"Scores!K28","v":0},{"$f":"Scores!L28","v":0},{"$f":"Scores!M28","v":0},{"$f":"Scores!N28","v":0},{"$f":"Scores!O28","v":0},-0.70710678118654746,2.9512994231491119,2.9512994231491119,{"$f":"IF(R37<'Grading Scale'!G$8,IF(R37<'Grading Scale'!G$13,'Grading Scale'!E$13,IF(R37<'Grading Scale'!G$12,'Grading Scale'!E$11,IF(R37<'Grading Scale'!G$11,'Grading Scale'!E$9,IF(R37<'Grading Scale'!G$10,'Grading Scale'!E$7,IF(R37<'Grading Scale'!G$9,'Grading Scale'!E$5,'Grading Scale'!E$3))))),IF(R37<'Grading Scale'!G$7,'Grading Scale'!B$13,IF(R37<'Grading Scale'!G$6,'Grading Scale'!B$11,IF(R37<'Grading Scale'!G$5,'Grading Scale'!B$9,IF(R37<'Grading Scale'!G$4,'Grading Scale'!B$7,IF(R37<'Grading Scale'!G$3,'Grading Scale'!B$5,'Grading Scale'!B$3))))))","v":3},{"$f":"Scores!B28","v":0},{"$f":"IF(S37>='Grading Scale'!B$13,IF(S37='Grading Scale'!B$3,'Grading Scale'!C$3,IF(S37='Grading Scale'!B$5,'Grading Scale'!C$5,IF(S37='Grading Scale'!B$7,'Grading Scale'!C$7,IF(S37='Grading Scale'!B$9,'Grading Scale'!C$9,IF(S37='Grading Scale'!B$11,'Grading Scale'!C$11,'Grading Scale'!C$13))))),IF(S37='Grading Scale'!E$3,'Grading Scale'!F$3,IF(S37='Grading Scale'!E$5,'Grading Scale'!F$5,IF(S37='Grading Scale'!E$7,'Grading Scale'!F$7,IF(S37='Grading Scale'!E$9,'Grading Scale'!F$9,IF(S37='Grading Scale'!E$11,'Grading Scale'!F$11,'Grading Scale'!F$13))))))","v":"B    "}," ",null,""]
[{"$f":"Scores!A29","v":0},{"$f":"Scores!B29","v":0},{"$f":"Scores!C29","v":0},{"$f":"Scores!D29","v":0},{"$f":"Scores!E29","v":0},{"$f":"Scores!F29","v":0},{"$f":"Scores!G29","v":0},{"$f":"Scores!H29","v":0},{"$f":"Scores!I29","v":0},{"$f":"Scores!J29","v":0},{"$f":"Scores!K29","v":0},{"$f":"Scores!L29","v":0},{"$f":"Scores!M29","v":0},{"$f":"Scores!N29","v":0},{"$f":"Scores!O29","v":0},-0.70710678118654746,2.9512994231491119,2.9512994231491119,{"$f":"IF(R38<'Grading Scale'!G$8,IF(R38<'Grading Scale'!G$13,'Grading Scale'!E$13,IF(R38<'Grading Scale'!G$12,'Grading Scale'!E$11,IF(R38<'Grading Scale'!G$11,'Grading Scale'!E$9,IF(R38<'Grading Scale'!G$10,'Grading Scale'!E$7,IF(R38<'Grading Scale'!G$9,'Grading Scale'!E$5,'Grading Scale'!E$3))))),IF(R38<'Grading Scale'!G$7,'Grading Scale'!B$13,IF(R38<'Grading Scale'!G$6,'Grading Scale'!B$11,IF(R38<'Grading Scale'!G$5,'Grading Scale'!B$9,IF(R38<'Grading Scale'!G$4,'Grading Scale'!B$7,IF(R38<'Grading Scale'!G$3,'Grading Scale'!B$5,'Grading Scale'!B$3))))))","v":3},{"$f":"Scores!B29","v":0},{"$f":"IF(S38>='Grading Scale'!B$13,IF(S38='Grading Scale'!B$3,'Grading Scale'!C$3,IF(S38='Grading Scale'!B$5,'Grading Scale'!C$5,IF(S38='Grading Scale'!B$7,'Grading Scale'!C$7,IF(S38='Grading Scale'!B$9,'Grading Scale'!C$9,IF(S38='Grading Scale'!B$11,'Grading Scale'!C$11,'Grading Scale'!C$13))))),IF(S38='Grading Scale'!E$3,'Grading Scale'!F$3,IF(S38='Grading Scale'!E$5,'Grading Scale'!F$5,IF(S38='Grading Scale'!E$7,'Grading Scale'!F$7,IF(S38='Grading Scale'!E$9,'Grading Scale'!F$9,IF(S38='Grading Scale'!E$11,'Grading Scale'!F$11,'Grading Scale'!F$13))))))","v":"B    "}," ",null,""]
[{"$f":"Scores!A30","v":0},{"$f":"Scores!B30","v":0},{"$f":"Scores!C30","v":0},{"$f":"Scores!D30","v":0},{"$f":"Scores!E30","v":0},{"$f":"Scores!F30","v":0},{"$f":"Scores!G30","v":0},{"$f":"Scores!H30","v":0},{"$f":"Scores!I30","v":0},{"$f":"Scores!J30","v":0},{"$f":"Scores!K30","v":0},{"$f":"Scores!L30","v":0},{"$f":"Scores!M30","v":0},{"$f":"Scores!N30","v":0},{"$f":"Scores!O30","v":0},-0.70710678118654746,2.9512994231491119,2.9512994231491119,{"$f":"IF(R39<'Grading Scale'!G$8,IF(R39<'Grading Scale'!G$13,'Grading Scale'!E$13,IF(R39<'Grading Scale'!G$12,'Grading Scale'!E$11,IF(R39<'Grading Scale'!G$11,'Grading Scale'!E$9,IF(R39<'Grading Scale'!G$10,'Grading Scale'!E$7,IF(R39<'Grading Scale'!G$9,'Grading Scale'!E$5,'Grading Scale'!E$3))))),IF(R39<'Grading Scale'!G$7,'Grading Scale'!B$13,IF(R39<'Grading Scale'!G$6,'Grading Scale'!B$11,IF(R39<'Grading Scale'!G$5,'Grading Scale'!B$9,IF(R39<'Grading Scale'!G$4,'Grading Scale'!B$7,IF(R39<'Grading Scale'!G$3,'Grading Scale'!B$5,'Grading Scale'!B$3))))))","v":3},{"$f":"Scores!B30","v":0},{"$f":"IF(S39>='Grading Scale'!B$13,IF(S39='Grading Scale'!B$3,'Grading Scale'!C$3,IF(S39='Grading Scale'!B$5,'Grading Scale'!C$5,IF(S39='Grading Scale'!B$7,'Grading Scale'!C$7,IF(S39='Grading Scale'!B$9,'Grading Scale'!C$9,IF(S39='Grading Scale'!B$11,'Grading Scale'!C$11,'Grading Scale'!C$13))))),IF(S39='Grading Scale'!E$3,'Grading Scale'!F$3,IF(S39='Grading Scale'!E$5,'Grading Scale'!F$5,IF(S39='Grading Scale'!E$7,'Grading Scale'!F$7,IF(S39='Grading Scale'!E$9,'Grading Scale'!F$9,IF(S39='Grading Scale'!E$11,'Grading Scale'!F$11,'Grading Scale'!F$13))))))","v":"B    "}," ",null,""]
[{"$f":"Scores!A31","v":0},{"$f":"Scores!B31","v":0},{"$f":"Scores!C31","v":0},{"$f":"Scores!D31","v":0},{"$f":"Scores!E31","v":0},{"$f":"Scores!F31","v":0},{"$f":"Scores!G31","v":0},{"$f":"Scores!H31","v":0},{"$f":"Scores!I31","v":0},{"$f":"Scores!J31","v":0},{"$f":"Scores!K31","v":0},{"$f":"Scores!L31","v":0},{"$f":"Scores!M31","v":0},{"$f":"Scores!N31","v":0},{"$f":"Scores!O31","v":0},-0.70710678118654746,2.9512994231491119,2.9512994231491119,{"$f":"IF(R40<'Grading Scale'!G$8,IF(R40<'Grading Scale'!G$13,'Grading Scale'!E$13,IF(R40<'Grading Scale'!G$12,'Grading Scale'!E$11,IF(R40<'Grading Scale'!G$11,'Grading Scale'!E$9,IF(R40<'Grading Scale'!G$10,'Grading Scale'!E$7,IF(R40<'Grading Scale'!G$9,'Grading Scale'!E$5,'Grading Scale'!E$3))))),IF(R40<'Grading Scale'!G$7,'Grading Scale'!B$13,IF(R40<'Grading Scale'!G$6,'Grading Scale'!B$11,IF(R40<'Grading Scale'!G$5,'Grading Scale'!B$9,IF(R40<'Grading Scale'!G$4,'Grading Scale'!B$7,IF(R40<'Grading Scale'!G$3,'Grading Scale'!B$5,'Grading Scale'!B$3))))))","v":3},{"$f":"Scores!B31","v":0},{"$f":"IF(S40>='Grading Scale'!B$13,IF(S40='Grading Scale'!B$3,'Grading Scale'!C$3,IF(S40='Grading Scale'!B$5,'Grading Scale'!C$5,IF(S40='Grading Scale'!B$7,'Grading Scale'!C$7,IF(S40='Grading Scale'!B$9,'Grading Scale'!C$9,IF(S40='Grading Scale'!B$11,'Grading Scale'!C$11,'Grading Scale'!C$13))))),IF(S40='Grading Scale'!E$3,'Grading Scale'!F$3,IF(S40='Grading Scale'!E$5,'Grading Scale'!F$5,IF(S40='Grading Scale'!E$7,'Grading Scale'!F$7,IF(S40='Grading Scale'!E$9,'Grading Scale'!F$9,IF(S40='Grading Scale'!E$11,'Grading Scale'!F$11,'Grading Scale'!F$13))))))","v":"B    "}," ",null,""]
[{"$f":"Scores!A32","v":0},{"$f":"Scores!B32","v":0},{"$f":"Scores!C32","v":0},{"$f":"Scores!D32","v":0},{"$f":"Scores!E32","v":0},{"$f":"Scores!F32","v":0},{"$f":"Scores!G32","v":0},{"$f":"Scores!H32","v":0},{"$f":"Scores!I32","v":0},{"$f":"Scores!J32","v":0},{"$f":"Scores!K32","v":0},{"$f":"Scores!L32","v":0},{"$f":"Scores!M32","v":0},{"$f":"Scores!N32","v":0},{"$f":"Scores!O32","v":0},-0.70710678118654746,2.9512994231491119,2.9512994231491119,{"$f":"IF(R41<'Grading Scale'!G$8,IF(R41<'Grading Scale'!G$13,'Grading Scale'!E$13,IF(R41<'Grading Scale'!G$12,'Grading Scale'!E$11,IF(R41<'Grading Scale'!G$11,'Grading Scale'!E$9,IF(R41<'Grading Scale'!G$10,'Grading Scale'!E$7,IF(R41<'Grading Scale'!G$9,'Grading Scale'!E$5,'Grading Scale'!E$3))))),IF(R41<'Grading Scale'!G$7,'Grading Scale'!B$13,IF(R41<'Grading Scale'!G$6,'Grading Scale'!B$11,IF(R41<'Grading Scale'!G$5,'Grading Scale'!B$9,IF(R41<'Grading Scale'!G$4,'Grading Scale'!B$7,IF(R41<'Grading Scale'!G$3,'Grading Scale'!B$5,'Grading Scale'!B$3))))))","v":3},{"$f":"Scores!B32","v":0},{"$f":"IF(S41>='Grading Scale'!B$13,IF(S41='Grading Scale'!B$3,'Grading Scale'!C$3,IF(S41='Grading Scale'!B$5,'Grading Scale'!C$5,IF(S41='Grading Scale'!B$7,'Grading Scale'!C$7,IF(S41='Grading Scale'!B$9,'Grading Scale'!C$9,IF(S41='Grading Scale'!B$11,'Grading Scale'!C$11,'Grading Scale'!C$13))))),IF(S41='Grading Scale'!E$3,'Grading Scale'!F$3,IF(S41='Grading Scale'!E$5,'Grading Scale'!F$5,IF(S41='Grading Scale'!E$7,'Grading Scale'!F$7,IF(S41='Grading Scale'!E$9,'Grading Scale'!F$9,IF(S41='Grading Scale'!E$11,'Grading Scale'!F$11,'Grading Scale'!F$13))))))","v":"B    "}," ",null,""]
[{"$f":"Scores!A33","v":0},{"$f":"Scores!B33","v":0},{"$f":"Scores!C33","v":0},{"$f":"Scores!D33","v":0},{"$f":"Scores!E33","v":0},{"$f":"Scores!F33","v":0},{"$f":"Scores!G33","v":0},{"$f":"Scores!H33","v":0},{"$f":"Scores!I33","v":0},{"$f":"Scores!J33","v":0},{"$f":"Scores!K33","v":0},{"$f":"Scores!L33","v":0},{"$f":"Scores!M33","v":0},{"$f":"Scores!N33","v":0},{"$f":"Scores!O33","v":0},-0.70710678118654746,2.9512994231491119,2.9512994231491119,{"$f":"IF(R42<'Grading Scale'!G$8,IF(R42<'Grading Scale'!G$13,'Grading Scale'!E$13,IF(R42<'Grading Scale'!G$12,'Grading Scale'!E$11,IF(R42<'Grading Scale'!G$11,'Grading Scale'!E$9,IF(R42<'Grading Scale'!G$10,'Grading Scale'!E$7,IF(R42<'Grading Scale'!G$9,'Grading Scale'!E$5,'Grading Scale'!E$3))))),IF(R42<'Grading Scale'!G$7,'Grading Scale'!B$13,IF(R42<'Grading Scale'!G$6,'Grading Scale'!B$11,IF(R42<'Grading Scale'!G$5,'Grading Scale'!B$9,IF(R42<'Grading Scale'!G$4,'Grading Scale'!B$7,IF(R42<'Grading Scale'!G$3,'Grading Scale'!B$5,'Grading Scale'!B$3))))))","v":3},{"$f":"Scores!B33","v":0},{"$f":"IF(S42>='Grading Scale'!B$13,IF(S42='Grading Scale'!B$3,'Grading Scale'!C$3,IF(S42='Grading Scale'!B$5,'Grading Scale'!C$5,IF(S42='Grading Scale'!B$7,'Grading Scale'!C$7,IF(S42='Grading Scale'!B$9,'Grading Scale'!C$9,IF(S42='Grading Scale'!B$11,'Grading Scale'!C$11,'Grading Scale'!C$13))))),IF(S42='Grading Scale'!E$3,'Grading Scale'!F$3,IF(S42='Grading Scale'!E$5,'Grading Scale'!F$5,IF(S42='Grading Scale'!E$7,'Grading Scale'!F$7,IF(S42='Grading Scale'!E$9,'Grading Scale'!F$9,IF(S42='Grading Scale'!E$11,'Grading Scale'!F$11,'Grading Scale'!F$13))))))","v":"B    "}," ",null,""]
[{"$f":"Scores!A34","v":0},{"$f":"Scores!B34","v":0},{"$f":"Scores!C34","v":0},{"$f":"Scores!D34","v":0},{"$f":"Scores!E34","v":0},{"$f":"Scores!F34","v":0},{"$f":"Scores!G34","v":0},{"$f":"Scores!H34","v":0},{"$f":"Scores!I34","v":0},{"$f":"Scores!J34","v":0},{"$f":"Scores!K34","v":0},{"$f":"Scores!L34","v":0},{"$f":"Scores!M34","v":0},{"$f":"Scores!N34","v":0},{"$f":"Scores!O34","v":0},-0.70710678118654746,2.9512994231491119,2.9512994231491119,{"$f":"IF(R43<'Grading Scale'!G$8,IF(R43<'Grading Scale'!G$13,'Grading Scale'!E$13,IF(R43<'Grading Scale'!G$12,'Grading Scale'!E$11,IF(R43<'Grading Scale'!G$11,'Grading Scale'!E$9,IF(R43<'Grading Scale'!G$10,'Grading Scale'!E$7,IF(R43<'Grading Scale'!G$9,'Grading Scale'!E$5,'Grading Scale'!E$3))))),IF(R43<'Grading Scale'!G$7,'Grading Scale'!B$13,IF(R43<'Grading Scale'!G$6,'Grading Scale'!B$11,IF(R43<'Grading Scale'!G$5,'Grading Scale'!B$9,IF(R43<'Grading Scale'!G$4,'Grading Scale'!B$7,IF(R43<'Grading Scale'!G$3,'Grading Scale'!B$5,'Grading Scale'!B$3))))))","v":3},{"$f":"Scores!B34","v":0},{"$f":"IF(S43>='Grading Scale'!B$13,IF(S43='Grading Scale'!B$3,'Grading Scale'!C$3,IF(S43='Grading Scale'!B$5,'Grading Scale'!C$5,IF(S43='Grading Scale'!B$7,'Grading Scale'!C$7,IF(S43='Grading Scale'!B$9,'Grading Scale'!C$9,IF(S43='Grading Scale'!B$11,'Grading Scale'!C$11,'Grading Scale'!C$13))))),IF(S43='Grading Scale'!E$3,'Grading Scale'!F$3,IF(S43='Grading Scale'!E$5,'Grading Scale'!F$5,IF(S43='Grading Scale'!E$7,'Grading Scale'!F$7,IF(S43='Grading Scale'!E$9,'Grading Scale'!F$9,IF(S43='Grading Scale'!E$11,'Grading Scale'!F$11,'Grading Scale'!F$13))))))","v":"B    "}," ",null,""]
[{"$f":"Scores!A35","v":0},{"$f":"Scores!B35","v":0},{"$f":"Scores!C35","v":0},{"$f":"Scores!D35","v":0},{"$f":"Scores!E35","v":0},{"$f":"Scores!F35","v":0},{"$f":"Scores!G35","v":0},{"$f":"Scores!H35","v":0},{"$f":"Scores!I35","v":0},{"$f":"Scores!J35","v":0},{"$f":"Scores!K35","v":0},{"$f":"Scores!L35","v":0},{"$f":"Scores!M35","v":0},{"$f":"Scores!N35","v":0},{"$f":"Scores!O35","v":0},-0.70710678118654746,2.9512994231491119,2.9512994231491119,{"$f":"IF(R44<'Grading Scale'!G$8,IF(R44<'Grading Scale'!G$13,'Grading Scale'!E$13,IF(R44<'Grading Scale'!G$12,'Grading Scale'!E$11,IF(R44<'Grading Scale'!G$11,'Grading Scale'!E$9,IF(R44<'Grading Scale'!G$10,'Grading Scale'!E$7,IF(R44<'Grading Scale'!G$9,'Grading Scale'!E$5,'Grading Scale'!E$3))))),IF(R44<'Grading Scale'!G$7,'Grading Scale'!B$13,IF(R44<'Grading Scale'!G$6,'Grading Scale'!B$11,IF(R44<'Grading Scale'!G$5,'Grading Scale'!B$9,IF(R44<'Grading Scale'!G$4,'Grading Scale'!B$7,IF(R44<'Grading Scale'!G$3,'Grading Scale'!B$5,'Grading Scale'!B$3))))))","v":3},{"$f":"Scores!B35","v":0},{"$f":"IF(S44>='Grading Scale'!B$13,IF(S44='Grading Scale'!B$3,'Grading Scale'!C$3,IF(S44='Grading Scale'!B$5,'Grading Scale'!C$5,IF(S44='Grading Scale'!B$7,'Grading Scale'!C$7,IF(S44='Grading Scale'!B$9,'Grading Scale'!C$9,IF(S44='Grading Scale'!B$11,'Grading Scale'!C$11,'Grading Scale'!C$13))))),IF(S44='Grading Scale'!E$3,'Grading Scale'!F$3,IF(S44='Grading Scale'!E$5,'Grading Scale'!F$5,IF(S44='Grading Scale'!E$7,'Grading Scale'!F$7,IF(S44='Grading Scale'!E$9,'Grading Scale'!F$9,IF(S44='Grading Scale'!E$11,'Grading Scale'!F$11,'Grading Scale'!F$13))))))","v":"B    "}," ",null,""]
[{"$f":"Scores!A36","v":0},{"$f":"Scores!B36","v":0},{"$f":"Scores!C36","v":0},{"$f":"Scores!D36","v":0},{"$f":"Scores!E36","v":0},{"$f":"Scores!F36","v":0},{"$f":"Scores!G36","v":0},{"$f":"Scores!H36","v":0},{"$f":"Scores!I36","v":0},{"$f":"Scores!J36","v":0},{"$f":"Scores!K36","v":0},{"$f":"Scores!L36","v":0},{"$f":"Scores!M36","v":0},{"$f":"Scores!N36","v":0},{"$f":"Scores!O36","v":0},-0.70710678118654746,2.9512994231491119,2.9512994231491119,{"$f":"IF(R45<'Grading Scale'!G$8,IF(R45<'Grading Scale'!G$13,'Grading Scale'!E$13,IF(R45<'Grading Scale'!G$12,'Grading Scale'!E$11,IF(R45<'Grading Scale'!G$11,'Grading Scale'!E$9,IF(R45<'Grading Scale'!G$10,'Grading Scale'!E$7,IF(R45<'Grading Scale'!G$9,'Grading Scale'!E$5,'Grading Scale'!E$3))))),IF(R45<'Grading Scale'!G$7,'Grading Scale'!B$13,IF(R45<'Grading Scale'!G$6,'Grading Scale'!B$11,IF(R45<'Grading Scale'!G$5,'Grading Scale'!B$9,IF(R45<'Grading Scale'!G$4,'Grading Scale'!B$7,IF(R45<'Grading Scale'!G$3,'Grading Scale'!B$5,'Grading Scale'!B$3))))))","v":3},{"$f":"Scores!B36","v":0},{"$f":"IF(S45>='Grading Scale'!B$13,IF(S45='Grading Scale'!B$3,'Grading Scale'!C$3,IF(S45='Grading Scale'!B$5,'Grading Scale'!C$5,IF(S45='Grading Scale'!B$7,'Grading Scale'!C$7,IF(S45='Grading Scale'!B$9,'Grading Scale'!C$9,IF(S45='Grading Scale'!B$11,'Grading Scale'!C$11,'Grading Scale'!C$13))))),IF(S45='Grading Scale'!E$3,'Grading Scale'!F$3,IF(S45='Grading Scale'!E$5,'Grading Scale'!F$5,IF(S45='Grading Scale'!E$7,'Grading Scale'!F$7,IF(S45='Grading Scale'!E$9,'Grading Scale'!F$9,IF(S45='Grading Scale'!E$11,'Grading Scale'!F$11,'Grading Scale'!F$13))))))","v":"B    "}," ",null,""]
[{"$f":"Scores!A37","v":0},{"$f":"Scores!B37","v":0},{"$f":"Scores!C37","v":0},{"$f":"Scores!D37","v":0},{"$f":"Scores!E37","v":0},{"$f":"Scores!F37","v":0},{"$f":"Scores!G37","v":0},{"$f":"Scores!H37","v":0},{"$f":"Scores!I37","v":0},{"$f":"Scores!J37","v":0},{"$f":"Scores!K37","v":0},{"$f":"Scores!L37","v":0},{"$f":"Scores!M37","v":0},{"$f":"Scores!N37","v":0},{"$f":"Scores!O37","v":0},-0.70710678118654746,2.9512994231491119,2.9512994231491119,{"$f":"IF(R46<'Grading Scale'!G$8,IF(R46<'Grading Scale'!G$13,'Grading Scale'!E$13,IF(R46<'Grading Scale'!G$12,'Grading Scale'!E$11,IF(R46<'Grading Scale'!G$11,'Grading Scale'!E$9,IF(R46<'Grading Scale'!G$10,'Grading Scale'!E$7,IF(R46<'Grading Scale'!G$9,'Grading Scale'!E$5,'Grading Scale'!E$3))))),IF(R46<'Grading Scale'!G$7,'Grading Scale'!B$13,IF(R46<'Grading Scale'!G$6,'Grading Scale'!B$11,IF(R46<'Grading Scale'!G$5,'Grading Scale'!B$9,IF(R46<'Grading Scale'!G$4,'Grading Scale'!B$7,IF(R46<'Grading Scale'!G$3,'Grading Scale'!B$5,'Grading Scale'!B$3))))))","v":3},{"$f":"Scores!B37","v":0},{"$f":"IF(S46>='Grading Scale'!B$13,IF(S46='Grading Scale'!B$3,'Grading Scale'!C$3,IF(S46='Grading Scale'!B$5,'Grading Scale'!C$5,IF(S46='Grading Scale'!B$7,'Grading Scale'!C$7,IF(S46='Grading Scale'!B$9,'Grading Scale'!C$9,IF(S46='Grading Scale'!B$11,'Grading Scale'!C$11,'Grading Scale'!C$13))))),IF(S46='Grading Scale'!E$3,'Grading Scale'!F$3,IF(S46='Grading Scale'!E$5,'Grading Scale'!F$5,IF(S46='Grading Scale'!E$7,'Grading Scale'!F$7,IF(S46='Grading Scale'!E$9,'Grading Scale'!F$9,IF(S46='Grading Scale'!E$11,'Grading Scale'!F$11,'Grading Scale'!F$13))))))","v":"B    "}," ",null,""]
[{"$f":"Scores!A38","v":0},{"$f":"Scores!B38","v":0},{"$f":"Scores!C38","v":0},{"$f":"Scores!D38","v":0},{"$f":"Scores!E38","v":0},{"$f":"Scores!F38","v":0},{"$f":"Scores!G38","v":0},{"$f":"Scores!H38","v":0},{"$f":"Scores!I38","v":0},{"$f":"Scores!J38","v":0},{"$f":"Scores!K38","v":0},{"$f":"Scores!L38","v":0},{"$f":"Scores!M38","v":0},{"$f":"Scores!N38","v":0},{"$f":"Scores!O38","v":0},-0.70710678118654746,2.9512994231491119,2.9512994231491119,{"$f":"IF(R47<'Grading Scale'!G$8,IF(R47<'Grading Scale'!G$13,'Grading Scale'!E$13,IF(R47<'Grading Scale'!G$12,'Grading Scale'!E$11,IF(R47<'Grading Scale'!G$11,'Grading Scale'!E$9,IF(R47<'Grading Scale'!G$10,'Grading Scale'!E$7,IF(R47<'Grading Scale'!G$9,'Grading Scale'!E$5,'Grading Scale'!E$3))))),IF(R47<'Grading Scale'!G$7,'Grading Scale'!B$13,IF(R47<'Grading Scale'!G$6,'Grading Scale'!B$11,IF(R47<'Grading Scale'!G$5,'Grading Scale'!B$9,IF(R47<'Grading Scale'!G$4,'Grading Scale'!B$7,IF(R47<'Grading Scale'!G$3,'Grading Scale'!B$5,'Grading Scale'!B$3))))))","v":3},{"$f":"Scores!B38","v":0},{"$f":"IF(S47>='Grading Scale'!B$13,IF(S47='Grading Scale'!B$3,'Grading Scale'!C$3,IF(S47='Grading Scale'!B$5,'Grading Scale'!C$5,IF(S47='Grading Scale'!B$7,'Grading Scale'!C$7,IF(S47='Grading Scale'!B$9,'Grading Scale'!C$9,IF(S47='Grading Scale'!B$11,'Grading Scale'!C$11,'Grading Scale'!C$13))))),IF(S47='Grading Scale'!E$3,'Grading Scale'!F$3,IF(S47='Grading Scale'!E$5,'Grading Scale'!F$5,IF(S47='Grading Scale'!E$7,'Grading Scale'!F$7,IF(S47='Grading Scale'!E$9,'Grading Scale'!F$9,IF(S47='Grading Scale'!E$11,'Grading Scale'!F$11,'Grading Scale'!F$13))))))","v":"B    "}," ",null,""]
[{"$f":"Scores!A39","v":0},{"$f":"Scores!B39","v":0},{"$f":"Scores!C39","v":0},{"$f":"Scores!D39","v":0},{"$f":"Scores!E39","v":0},{"$f":"Scores!F39","v":0},{"$f":"Scores!G39","v":0},{"$f":"Scores!H39","v":0},{"$f":"Scores!I39","v":0},{"$f":"Scores!J39","v":0},{"$f":"Scores!K39","v":0},{"$f":"Scores!L39","v":0},{"$f":"Scores!M39","v":0},{"$f":"Scores!N39","v":0},{"$f":"Scores!O39","v":0},-0.70710678118654746,2.9512994231491119,2.9512994231491119,{"$f":"IF(R48<'Grading Scale'!G$8,IF(R48<'Grading Scale'!G$13,'Grading Scale'!E$13,IF(R48<'Grading Scale'!G$12,'Grading Scale'!E$11,IF(R48<'Grading Scale'!G$11,'Grading Scale'!E$9,IF(R48<'Grading Scale'!G$10,'Grading Scale'!E$7,IF(R48<'Grading Scale'!G$9,'Grading Scale'!E$5,'Grading Scale'!E$3))))),IF(R48<'Grading Scale'!G$7,'Grading Scale'!B$13,IF(R48<'Grading Scale'!G$6,'Grading Scale'!B$11,IF(R48<'Grading Scale'!G$5,'Grading Scale'!B$9,IF(R48<'Grading Scale'!G$4,'Grading Scale'!B$7,IF(R48<'Grading Scale'!G$3,'Grading Scale'!B$5,'Grading Scale'!B$3))))))","v":3},{"$f":"Scores!B39","v":0},{"$f":"IF(S48>='Grading Scale'!B$13,IF(S48='Grading Scale'!B$3,'Grading Scale'!C$3,IF(S48='Grading Scale'!B$5,'Grading Scale'!C$5,IF(S48='Grading Scale'!B$7,'Grading Scale'!C$7,IF(S48='Grading Scale'!B$9,'Grading Scale'!C$9,IF(S48='Grading Scale'!B$11,'Grading Scale'!C$11,'Grading Scale'!C$13))))),IF(S48='Grading Scale'!E$3,'Grading Scale'!F$3,IF(S48='Grading Scale'!E$5,'Grading Scale'!F$5,IF(S48='Grading Scale'!E$7,'Grading Scale'!F$7,IF(S48='Grading Scale'!E$9,'Grading Scale'!F$9,IF(S48='Grading Scale'!E$11,'Grading Scale'!F$11,'Grading Scale'!F$13))))))","v":"B    "}," ",null,""]
[{"$f":"Scores!A40","v":0},{"$f":"Scores!B40","v":0},{"$f":"Scores!C40","v":0},{"$f":"Scores!D40","v":0},{"$f":"Scores!E40","v":0},{"$f":"Scores!F40","v":0},{"$f":"Scores!G40","v":0},{"$f":"Scores!H40","v":0},{"$f":"Scores!I40","v":0},{"$f":"Scores!J40","v":0},{"$f":"Scores!K40","v":0},{"$f":"Scores!L40","v":0},{"$f":"Scores!M40","v":0},{"$f":"Scores!N40","v":0},{"$f":"Scores!O40","v":0},-0.70710678118654746,2.9512994231491119,2.9512994231491119,{"$f":"IF(R49<'Grading Scale'!G$8,IF(R49<'Grading Scale'!G$13,'Grading Scale'!E$13,IF(R49<'Grading Scale'!G$12,'Grading Scale'!E$11,IF(R49<'Grading Scale'!G$11,'Grading Scale'!E$9,IF(R49<'Grading Scale'!G$10,'Grading Scale'!E$7,IF(R49<'Grading Scale'!G$9,'Grading Scale'!E$5,'Grading Scale'!E$3))))),IF(R49<'Grading Scale'!G$7,'Grading Scale'!B$13,IF(R49<'Grading Scale'!G$6,'Grading Scale'!B$11,IF(R49<'Grading Scale'!G$5,'Grading Scale'!B$9,IF(R49<'Grading Scale'!G$4,'Grading Scale'!B$7,IF(R49<'Grading Scale'!G$3,'Grading Scale'!B$5,'Grading Scale'!B$3))))))","v":3},{"$f":"Scores!B40","v":0},{"$f":"IF(S49>='Grading Scale'!B$13,IF(S49='Grading Scale'!B$3,'Grading Scale'!C$3,IF(S49='Grading Scale'!B$5,'Grading Scale'!C$5,IF(S49='Grading Scale'!B$7,'Grading Scale'!C$7,IF(S49='Grading Scale'!B$9,'Grading Scale'!C$9,IF(S49='Grading Scale'!B$11,'Grading Scale'!C$11,'Grading Scale'!C$13))))),IF(S49='Grading Scale'!E$3,'Grading Scale'!F$3,IF(S49='Grading Scale'!E$5,'Grading Scale'!F$5,IF(S49='Grading Scale'!E$7,'Grading Scale'!F$7,IF(S49='Grading Scale'!E$9,'Grading Scale'!F$9,IF(S49='Grading Scale'!E$11,'Grading Scale'!F$11,'Grading Scale'!F$13))))))","v":"B    "}," ",null,""]
[{"$f":"Scores!A41","v":0},{"$f":"Scores!B41","v":0},{"$f":"Scores!C41","v":0},{"$f":"Scores!D41","v":0},{"$f":"Scores!E41","v":0},{"$f":"Scores!F41","v":0},{"$f":"Scores!G41","v":0},{"$f":"Scores!H41","v":0},{"$f":"Scores!I41","v":0},{"$f":"Scores!J41","v":0},{"$f":"Scores!K41","v":0},{"$f":"Scores!L41","v":0},{"$f":"Scores!M41","v":0},{"$f":"Scores!N41","v":0},{"$f":"Scores!O41","v":0},-0.70710678118654746,2.9512994231491119,2.9512994231491119,{"$f":"IF(R50<'Grading Scale'!G$8,IF(R50<'Grading Scale'!G$13,'Grading Scale'!E$13,IF(R50<'Grading Scale'!G$12,'Grading Scale'!E$11,IF(R50<'Grading Scale'!G$11,'Grading Scale'!E$9,IF(R50<'Grading Scale'!G$10,'Grading Scale'!E$7,IF(R50<'Grading Scale'!G$9,'Grading Scale'!E$5,'Grading Scale'!E$3))))),IF(R50<'Grading Scale'!G$7,'Grading Scale'!B$13,IF(R50<'Grading Scale'!G$6,'Grading Scale'!B$11,IF(R50<'Grading Scale'!G$5,'Grading Scale'!B$9,IF(R50<'Grading Scale'!G$4,'Grading Scale'!B$7,IF(R50<'Grading Scale'!G$3,'Grading Scale'!B$5,'Grading Scale'!B$3))))))","v":3},{"$f":"Scores!B41","v":0},{"$f":"IF(S50>='Grading Scale'!B$13,IF(S50='Grading Scale'!B$3,'Grading Scale'!C$3,IF(S50='Grading Scale'!B$5,'Grading Scale'!C$5,IF(S50='Grading Scale'!B$7,'Grading Scale'!C$7,IF(S50='Grading Scale'!B$9,'Grading Scale'!C$9,IF(S50='Grading Scale'!B$11,'Grading Scale'!C$11,'Grading Scale'!C$13))))),IF(S50='Grading Scale'!E$3,'Grading Scale'!F$3,IF(S50='Grading Scale'!E$5,'Grading Scale'!F$5,IF(S50='Grading Scale'!E$7,'Grading Scale'!F$7,IF(S50='Grading Scale'!E$9,'Grading Scale'!F$9,IF(S50='Grading Scale'!E$11,'Grading Scale'!F$11,'Grading Scale'!F$13))))))","v":"B    "}," ",null,""]
[{"$f":"Scores!A42","v":0},{"$f":"Scores!B42","v":0},{"$f":"Scores!C42","v":0},{"$f":"Scores!D42","v":0},{"$f":"Scores!E42","v":0},{"$f":"Scores!F42","v":0},{"$f":"Scores!G42","v":0},{"$f":"Scores!H42","v":0},{"$f":"Scores!I42","v":0},{"$f":"Scores!J42","v":0},{"$f":"Scores!K42","v":0},{"$f":"Scores!L42","v":0},{"$f":"Scores!M42","v":0},{"$f":"Scores!N42","v":0},{"$f":"Scores!O42","v":0},-0.70710678118654746,2.9512994231491119,2.9512994231491119,{"$f":"IF(R51<'Grading Scale'!G$8,IF(R51<'Grading Scale'!G$13,'Grading Scale'!E$13,IF(R51<'Grading Scale'!G$12,'Grading Scale'!E$11,IF(R51<'Grading Scale'!G$11,'Grading Scale'!E$9,IF(R51<'Grading Scale'!G$10,'Grading Scale'!E$7,IF(R51<'Grading Scale'!G$9,'Grading Scale'!E$5,'Grading Scale'!E$3))))),IF(R51<'Grading Scale'!G$7,'Grading Scale'!B$13,IF(R51<'Grading Scale'!G$6,'Grading Scale'!B$11,IF(R51<'Grading Scale'!G$5,'Grading Scale'!B$9,IF(R51<'Grading Scale'!G$4,'Grading Scale'!B$7,IF(R51<'Grading Scale'!G$3,'Grading Scale'!B$5,'Grading Scale'!B$3))))))","v":3},{"$f":"Scores!B42","v":0},{"$f":"IF(S51>='Grading Scale'!B$13,IF(S51='Grading Scale'!B$3,'Grading Scale'!C$3,IF(S51='Grading Scale'!B$5,'Grading Scale'!C$5,IF(S51='Grading Scale'!B$7,'Grading Scale'!C$7,IF(S51='Grading Scale'!B$9,'Grading Scale'!C$9,IF(S51='Grading Scale'!B$11,'Grading Scale'!C$11,'Grading Scale'!C$13))))),IF(S51='Grading Scale'!E$3,'Grading Scale'!F$3,IF(S51='Grading Scale'!E$5,'Grading Scale'!F$5,IF(S51='Grading Scale'!E$7,'Grading Scale'!F$7,IF(S51='Grading Scale'!E$9,'Grading Scale'!F$9,IF(S51='Grading Scale'!E$11,'Grading Scale'!F$11,'Grading Scale'!F$13))))))","v":"B    "}," ",null,""]
[{"$f":"Scores!A43","v":0},{"$f":"Scores!B43","v":0},{"$f":"Scores!C43","v":0},{"$f":"Scores!D43","v":0},{"$f":"Scores!E43","v":0},{"$f":"Scores!F43","v":0},{"$f":"Scores!G43","v":0},{"$f":"Scores!H43","v":0},{"$f":"Scores!I43","v":0},{"$f":"Scores!J43","v":0},{"$f":"Scores!K43","v":0},{"$f":"Scores!L43","v":0},{"$f":"Scores!M43","v":0},{"$f":"Scores!N43","v":0},{"$f":"Scores!O43","v":0},-0.70710678118654746,2.9512994231491119,2.9512994231491119,{"$f":"IF(R52<'Grading Scale'!G$8,IF(R52<'Grading Scale'!G$13,'Grading Scale'!E$13,IF(R52<'Grading Scale'!G$12,'Grading Scale'!E$11,IF(R52<'Grading Scale'!G$11,'Grading Scale'!E$9,IF(R52<'Grading Scale'!G$10,'Grading Scale'!E$7,IF(R52<'Grading Scale'!G$9,'Grading Scale'!E$5,'Grading Scale'!E$3))))),IF(R52<'Grading Scale'!G$7,'Grading Scale'!B$13,IF(R52<'Grading Scale'!G$6,'Grading Scale'!B$11,IF(R52<'Grading Scale'!G$5,'Grading Scale'!B$9,IF(R52<'Grading Scale'!G$4,'Grading Scale'!B$7,IF(R52<'Grading Scale'!G$3,'Grading Scale'!B$5,'Grading Scale'!B$3))))))","v":3},{"$f":"Scores!B43","v":0},{"$f":"IF(S52>='Grading Scale'!B$13,IF(S52='Grading Scale'!B$3,'Grading Scale'!C$3,IF(S52='Grading Scale'!B$5,'Grading Scale'!C$5,IF(S52='Grading Scale'!B$7,'Grading Scale'!C$7,IF(S52='Grading Scale'!B$9,'Grading Scale'!C$9,IF(S52='Grading Scale'!B$11,'Grading Scale'!C$11,'Grading Scale'!C$13))))),IF(S52='Grading Scale'!E$3,'Grading Scale'!F$3,IF(S52='Grading Scale'!E$5,'Grading Scale'!F$5,IF(S52='Grading Scale'!E$7,'Grading Scale'!F$7,IF(S52='Grading Scale'!E$9,'Grading Scale'!F$9,IF(S52='Grading Scale'!E$11,'Grading Scale'!F$11,'Grading Scale'!F$13))))))","v":"B    "}," ",null,""]
[{"$f":"Scores!A44","v":0},{"$f":"Scores!B44","v":0},{"$f":"Scores!C44","v":0},{"$f":"Scores!D44","v":0},{"$f":"Scores!E44","v":0},{"$f":"Scores!F44","v":0},{"$f":"Scores!G44","v":0},{"$f":"Scores!H44","v":0},{"$f":"Scores!I44","v":0},{"$f":"Scores!J44","v":0},{"$f":"Scores!K44","v":0},{"$f":"Scores!L44","v":0},{"$f":"Scores!M44","v":0},{"$f":"Scores!N44","v":0},{"$f":"Scores!O44","v":0},-0.70710678118654746,2.9512994231491119,2.9512994231491119,{"$f":"IF(R53<'Grading Scale'!G$8,IF(R53<'Grading Scale'!G$13,'Grading Scale'!E$13,IF(R53<'Grading Scale'!G$12,'Grading Scale'!E$11,IF(R53<'Grading Scale'!G$11,'Grading Scale'!E$9,IF(R53<'Grading Scale'!G$10,'Grading Scale'!E$7,IF(R53<'Grading Scale'!G$9,'Grading Scale'!E$5,'Grading Scale'!E$3))))),IF(R53<'Grading Scale'!G$7,'Grading Scale'!B$13,IF(R53<'Grading Scale'!G$6,'Grading Scale'!B$11,IF(R53<'Grading Scale'!G$5,'Grading Scale'!B$9,IF(R53<'Grading Scale'!G$4,'Grading Scale'!B$7,IF(R53<'Grading Scale'!G$3,'Grading Scale'!B$5,'Grading Scale'!B$3))))))","v":3},{"$f":"Scores!B44","v":0},{"$f":"IF(S53>='Grading Scale'!B$13,IF(S53='Grading Scale'!B$3,'Grading Scale'!C$3,IF(S53='Grading Scale'!B$5,'Grading Scale'!C$5,IF(S53='Grading Scale'!B$7,'Grading Scale'!C$7,IF(S53='Grading Scale'!B$9,'Grading Scale'!C$9,IF(S53='Grading Scale'!B$11,'Grading Scale'!C$11,'Grading Scale'!C$13))))),IF(S53='Grading Scale'!E$3,'Grading Scale'!F$3,IF(S53='Grading Scale'!E$5,'Grading Scale'!F$5,IF(S53='Grading Scale'!E$7,'Grading Scale'!F$7,IF(S53='Grading Scale'!E$9,'Grading Scale'!F$9,IF(S53='Grading Scale'!E$11,'Grading Scale'!F$11,'Grading Scale'!F$13))))))","v":"B    "}," ",null,""]
[{"$f":"Scores!A45","v":0},{"$f":"Scores!B45","v":0},{"$f":"Scores!C45","v":0},{"$f":"Scores!D45","v":0},{"$f":"Scores!E45","v":0},{"$f":"Scores!F45","v":0},{"$f":"Scores!G45","v":0},{"$f":"Scores!H45","v":0},{"$f":"Scores!I45","v":0},{"$f":"Scores!J45","v":0},{"$f":"Scores!K45","v":0},{"$f":"Scores!L45","v":0},{"$f":"Scores!M45","v":0},{"$f":"Scores!N45","v":0},{"$f":"Scores!O45","v":0},-0.70710678118654746,2.9512994231491119,2.9512994231491119,{"$f":"IF(R54<'Grading Scale'!G$8,IF(R54<'Grading Scale'!G$13,'Grading Scale'!E$13,IF(R54<'Grading Scale'!G$12,'Grading Scale'!E$11,IF(R54<'Grading Scale'!G$11,'Grading Scale'!E$9,IF(R54<'Grading Scale'!G$10,'Grading Scale'!E$7,IF(R54<'Grading Scale'!G$9,'Grading Scale'!E$5,'Grading Scale'!E$3))))),IF(R54<'Grading Scale'!G$7,'Grading Scale'!B$13,IF(R54<'Grading Scale'!G$6,'Grading Scale'!B$11,IF(R54<'Grading Scale'!G$5,'Grading Scale'!B$9,IF(R54<'Grading Scale'!G$4,'Grading Scale'!B$7,IF(R54<'Grading Scale'!G$3,'Grading Scale'!B$5,'Grading Scale'!B$3))))))","v":3},{"$f":"Scores!B45","v":0},{"$f":"IF(S54>='Grading Scale'!B$13,IF(S54='Grading Scale'!B$3,'Grading Scale'!C$3,IF(S54='Grading Scale'!B$5,'Grading Scale'!C$5,IF(S54='Grading Scale'!B$7,'Grading Scale'!C$7,IF(S54='Grading Scale'!B$9,'Grading Scale'!C$9,IF(S54='Grading Scale'!B$11,'Grading Scale'!C$11,'Grading Scale'!C$13))))),IF(S54='Grading Scale'!E$3,'Grading Scale'!F$3,IF(S54='Grading Scale'!E$5,'Grading Scale'!F$5,IF(S54='Grading Scale'!E$7,'Grading Scale'!F$7,IF(S54='Grading Scale'!E$9,'Grading Scale'!F$9,IF(S54='Grading Scale'!E$11,'Grading Scale'!F$11,'Grading Scale'!F$13))))))","v":"B    "}," ",null,""]
[{"$f":"Scores!A46","v":0},{"$f":"Scores!B46","v":0},{"$f":"Scores!C46","v":0},{"$f":"Scores!D46","v":0},{"$f":"Scores!E46","v":0},{"$f":"Scores!F46","v":0},{"$f":"Scores!G46","v":0},{"$f":"Scores!H46","v":0},{"$f":"Scores!I46","v":0},{"$f":"Scores!J46","v":0},{"$f":"Scores!K46","v":0},{"$f":"Scores!L46","v":0},{"$f":"Scores!M46","v":0},{"$f":"Scores!N46","v":0},{"$f":"Scores!O46","v":0},-0.70710678118654746,2.9512994231491119,2.9512994231491119,{"$f":"IF(R55<'Grading Scale'!G$8,IF(R55<'Grading Scale'!G$13,'Grading Scale'!E$13,IF(R55<'Grading Scale'!G$12,'Grading Scale'!E$11,IF(R55<'Grading Scale'!G$11,'Grading Scale'!E$9,IF(R55<'Grading Scale'!G$10,'Grading Scale'!E$7,IF(R55<'Grading Scale'!G$9,'Grading Scale'!E$5,'Grading Scale'!E$3))))),IF(R55<'Grading Scale'!G$7,'Grading Scale'!B$13,IF(R55<'Grading Scale'!G$6,'Grading Scale'!B$11,IF(R55<'Grading Scale'!G$5,'Grading Scale'!B$9,IF(R55<'Grading Scale'!G$4,'Grading Scale'!B$7,IF(R55<'Grading Scale'!G$3,'Grading Scale'!B$5,'Grading Scale'!B$3))))))","v":3},{"$f":"Scores!B46","v":0},{"$f":"IF(S55>='Grading Scale'!B$13,IF(S55='Grading Scale'!B$3,'Grading Scale'!C$3,IF(S55='Grading Scale'!B$5,'Grading Scale'!C$5,IF(S55='Grading Scale'!B$7,'Grading Scale'!C$7,IF(S55='Grading Scale'!B$9,'Grading Scale'!C$9,IF(S55='Grading Scale'!B$11,'Grading Scale'!C$11,'Grading Scale'!C$13))))),IF(S55='Grading Scale'!E$3,'Grading Scale'!F$3,IF(S55='Grading Scale'!E$5,'Grading Scale'!F$5,IF(S55='Grading Scale'!E$7,'Grading Scale'!F$7,IF(S55='Grading Scale'!E$9,'Grading Scale'!F$9,IF(S55='Grading Scale'!E$11,'Grading Scale'!F$11,'Grading Scale'!F$13))))))","v":"B    "}," ",null,""]
[{"$f":"Scores!A47","v":0},{"$f":"Scores!B47","v":0},{"$f":"Scores!C47","v":0},{"$f":"Scores!D47","v":0},{"$f":"Scores!E47","v":0},{"$f":"Scores!F47","v":0},{"$f":"Scores!G47","v":0},{"$f":"Scores!H47","v":0},{"$f":"Scores!I47","v":0},{"$f":"Scores!J47","v":0},{"$f":"Scores!K47","v":0},{"$f":"Scores!L47","v":0},{"$f":"Scores!M47","v":0},{"$f":"Scores!N47","v":0},{"$f":"Scores!O47","v":0},-0.70710678118654746,2.9512994231491119,2.9512994231491119,{"$f":"IF(R56<'Grading Scale'!G$8,IF(R56<'Grading Scale'!G$13,'Grading Scale'!E$13,IF(R56<'Grading Scale'!G$12,'Grading Scale'!E$11,IF(R56<'Grading Scale'!G$11,'Grading Scale'!E$9,IF(R56<'Grading Scale'!G$10,'Grading Scale'!E$7,IF(R56<'Grading Scale'!G$9,'Grading Scale'!E$5,'Grading Scale'!E$3))))),IF(R56<'Grading Scale'!G$7,'Grading Scale'!B$13,IF(R56<'Grading Scale'!G$6,'Grading Scale'!B$11,IF(R56<'Grading Scale'!G$5,'Grading Scale'!B$9,IF(R56<'Grading Scale'!G$4,'Grading Scale'!B$7,IF(R56<'Grading Scale'!G$3,'Grading Scale'!B$5,'Grading Scale'!B$3))))))","v":3},{"$f":"Scores!B47","v":0},{"$f":"IF(S56>='Grading Scale'!B$13,IF(S56='Grading Scale'!B$3,'Grading Scale'!C$3,IF(S56='Grading Scale'!B$5,'Grading Scale'!C$5,IF(S56='Grading Scale'!B$7,'Grading Scale'!C$7,IF(S56='Grading Scale'!B$9,'Grading Scale'!C$9,IF(S56='Grading Scale'!B$11,'Grading Scale'!C$11,'Grading Scale'!C$13))))),IF(S56='Grading Scale'!E$3,'Grading Scale'!F$3,IF(S56='Grading Scale'!E$5,'Grading Scale'!F$5,IF(S56='Grading Scale'!E$7,'Grading Scale'!F$7,IF(S56='Grading Scale'!E$9,'Grading Scale'!F$9,IF(S56='Grading Scale'!E$11,'Grading Scale'!F$11,'Grading Scale'!F$13))))))","v":"B    "}," ",null,""]
[{"$f":"Scores!A48","v":0},{"$f":"Scores!B48","v":0},{"$f":"Scores!C48","v":0},{"$f":"Scores!D48","v":0},{"$f":"Scores!E48","v":0},{"$f":"Scores!F48","v":0},{"$f":"Scores!G48","v":0},{"$f":"Scores!H48","v":0},{"$f":"Scores!I48","v":0},{"$f":"Scores!J48","v":0},{"$f":"Scores!K48","v":0},{"$f":"Scores!L48","v":0},{"$f":"Scores!M48","v":0},{"$f":"Scores!N48","v":0},{"$f":"Scores!O48","v":0},-0.70710678118654746,2.9512994231491119,2.9512994231491119,{"$f":"IF(R57<'Grading Scale'!G$8,IF(R57<'Grading Scale'!G$13,'Grading Scale'!E$13,IF(R57<'Grading Scale'!G$12,'Grading Scale'!E$11,IF(R57<'Grading Scale'!G$11,'Grading Scale'!E$9,IF(R57<'Grading Scale'!G$10,'Grading Scale'!E$7,IF(R57<'Grading Scale'!G$9,'Grading Scale'!E$5,'Grading Scale'!E$3))))),IF(R57<'Grading Scale'!G$7,'Grading Scale'!B$13,IF(R57<'Grading Scale'!G$6,'Grading Scale'!B$11,IF(R57<'Grading Scale'!G$5,'Grading Scale'!B$9,IF(R57<'Grading Scale'!G$4,'Grading Scale'!B$7,IF(R57<'Grading Scale'!G$3,'Grading Scale'!B$5,'Grading Scale'!B$3))))))","v":3},{"$f":"Scores!B48","v":0},{"$f":"IF(S57>='Grading Scale'!B$13,IF(S57='Grading Scale'!B$3,'Grading Scale'!C$3,IF(S57='Grading Scale'!B$5,'Grading Scale'!C$5,IF(S57='Grading Scale'!B$7,'Grading Scale'!C$7,IF(S57='Grading Scale'!B$9,'Grading Scale'!C$9,IF(S57='Grading Scale'!B$11,'Grading Scale'!C$11,'Grading Scale'!C$13))))),IF(S57='Grading Scale'!E$3,'Grading Scale'!F$3,IF(S57='Grading Scale'!E$5,'Grading Scale'!F$5,IF(S57='Grading Scale'!E$7,'Grading Scale'!F$7,IF(S57='Grading Scale'!E$9,'Grading Scale'!F$9,IF(S57='Grading Scale'!E$11,'Grading Scale'!F$11,'Grading Scale'!F$13))))))","v":"B    "}," ",null,""]
[{"$f":"Scores!A49","v":0},{"$f":"Scores!B49","v":0},{"$f":"Scores!C49","v":0},{"$f":"Scores!D49","v":0},{"$f":"Scores!E49","v":0},{"$f":"Scores!F49","v":0},{"$f":"Scores!G49","v":0},{"$f":"Scores!H49","v":0},{"$f":"Scores!I49","v":0},{"$f":"Scores!J49","v":0},{"$f":"Scores!K49","v":0},{"$f":"Scores!L49","v":0},{"$f":"Scores!M49","v":0},{"$f":"Scores!N49","v":0},{"$f":"Scores!O49","v":0},-0.70710678118654746,2.9512994231491119,2.9512994231491119,{"$f":"IF(R58<'Grading Scale'!G$8,IF(R58<'Grading Scale'!G$13,'Grading Scale'!E$13,IF(R58<'Grading Scale'!G$12,'Grading Scale'!E$11,IF(R58<'Grading Scale'!G$11,'Grading Scale'!E$9,IF(R58<'Grading Scale'!G$10,'Grading Scale'!E$7,IF(R58<'Grading Scale'!G$9,'Grading Scale'!E$5,'Grading Scale'!E$3))))),IF(R58<'Grading Scale'!G$7,'Grading Scale'!B$13,IF(R58<'Grading Scale'!G$6,'Grading Scale'!B$11,IF(R58<'Grading Scale'!G$5,'Grading Scale'!B$9,IF(R58<'Grading Scale'!G$4,'Grading Scale'!B$7,IF(R58<'Grading Scale'!G$3,'Grading Scale'!B$5,'Grading Scale'!B$3))))))","v":3},{"$f":"Scores!B49","v":0},{"$f":"IF(S58>='Grading Scale'!B$13,IF(S58='Grading Scale'!B$3,'Grading Scale'!C$3,IF(S58='Grading Scale'!B$5,'Grading Scale'!C$5,IF(S58='Grading Scale'!B$7,'Grading Scale'!C$7,IF(S58='Grading Scale'!B$9,'Grading Scale'!C$9,IF(S58='Grading Scale'!B$11,'Grading Scale'!C$11,'Grading Scale'!C$13))))),IF(S58='Grading Scale'!E$3,'Grading Scale'!F$3,IF(S58='Grading Scale'!E$5,'Grading Scale'!F$5,IF(S58='Grading Scale'!E$7,'Grading Scale'!F$7,IF(S58='Grading Scale'!E$9,'Grading Scale'!F$9,IF(S58='Grading Scale'!E$11,'Grading Scale'!F$11,'Grading Scale'!F$13))))))","v":"B    "}," ",null,""]
[{"$f":"Scores!A50","v":0},{"$f":"Scores!B50","v":0},{"$f":"Scores!C50","v":0},{"$f":"Scores!D50","v":0},{"$f":"Scores!E50","v":0},{"$f":"Scores!F50","v":0},{"$f":"Scores!G50","v":0},{"$f":"Scores!H50","v":0},{"$f":"Scores!I50","v":0},{"$f":"Scores!J50","v":0},{"$f":"Scores!K50","v":0},{"$f":"Scores!L50","v":0},{"$f":"Scores!M50","v":0},{"$f":"Scores!N50","v":0},{"$f":"Scores!O50","v":0},-0.70710678118654746,2.9512994231491119,2.9512994231491119,{"$f":"IF(R59<'Grading Scale'!G$8,IF(R59<'Grading Scale'!G$13,'Grading Scale'!E$13,IF(R59<'Grading Scale'!G$12,'Grading Scale'!E$11,IF(R59<'Grading Scale'!G$11,'Grading Scale'!E$9,IF(R59<'Grading Scale'!G$10,'Grading Scale'!E$7,IF(R59<'Grading Scale'!G$9,'Grading Scale'!E$5,'Grading Scale'!E$3))))),IF(R59<'Grading Scale'!G$7,'Grading Scale'!B$13,IF(R59<'Grading Scale'!G$6,'Grading Scale'!B$11,IF(R59<'Grading Scale'!G$5,'Grading Scale'!B$9,IF(R59<'Grading Scale'!G$4,'Grading Scale'!B$7,IF(R59<'Grading Scale'!G$3,'Grading Scale'!B$5,'Grading Scale'!B$3))))))","v":3},{"$f":"Scores!B50","v":0},{"$f":"IF(S59>='Grading Scale'!B$13,IF(S59='Grading Scale'!B$3,'Grading Scale'!C$3,IF(S59='Grading Scale'!B$5,'Grading Scale'!C$5,IF(S59='Grading Scale'!B$7,'Grading Scale'!C$7,IF(S59='Grading Scale'!B$9,'Grading Scale'!C$9,IF(S59='Grading Scale'!B$11,'Grading Scale'!C$11,'Grading Scale'!C$13))))),IF(S59='Grading Scale'!E$3,'Grading Scale'!F$3,IF(S59='Grading Scale'!E$5,'Grading Scale'!F$5,IF(S59='Grading Scale'!E$7,'Grading Scale'!F$7,IF(S59='Grading Scale'!E$9,'Grading Scale'!F$9,IF(S59='Grading Scale'!E$11,'Grading Scale'!F$11,'Grading Scale'!F$13))))))","v":"B    "}," ",null,""]
[{"$f":"Scores!A51","v":0},{"$f":"Scores!B51","v":0},{"$f":"Scores!C51","v":0},{"$f":"Scores!D51","v":0},{"$f":"Scores!E51","v":0},{"$f":"Scores!F51","v":0},{"$f":"Scores!G51","v":0},{"$f":"Scores!H51","v":0},{"$f":"Scores!I51","v":0},{"$f":"Scores!J51","v":0},{"$f":"Scores!K51","v":0},{"$f":"Scores!L51","v":0},{"$f":"Scores!M51","v":0},{"$f":"Scores!N51","v":0},{"$f":"Scores!O51","v":0},-0.70710678118654746,2.9512994231491119,2.9512994231491119,{"$f":"IF(R60<'Grading Scale'!G$8,IF(R60<'Grading Scale'!G$13,'Grading Scale'!E$13,IF(R60<'Grading Scale'!G$12,'Grading Scale'!E$11,IF(R60<'Grading Scale'!G$11,'Grading Scale'!E$9,IF(R60<'Grading Scale'!G$10,'Grading Scale'!E$7,IF(R60<'Grading Scale'!G$9,'Grading Scale'!E$5,'Grading Scale'!E$3))))),IF(R60<'Grading Scale'!G$7,'Grading Scale'!B$13,IF(R60<'Grading Scale'!G$6,'Grading Scale'!B$11,IF(R60<'Grading Scale'!G$5,'Grading Scale'!B$9,IF(R60<'Grading Scale'!G$4,'Grading Scale'!B$7,IF(R60<'Grading Scale'!G$3,'Grading Scale'!B$5,'Grading Scale'!B$3))))))","v":3},{"$f":"Scores!B51","v":0},{"$f":"IF(S60>='Grading Scale'!B$13,IF(S60='Grading Scale'!B$3,'Grading Scale'!C$3,IF(S60='Grading Scale'!B$5,'Grading Scale'!C$5,IF(S60='Grading Scale'!B$7,'Grading Scale'!C$7,IF(S60='Grading Scale'!B$9,'Grading Scale'!C$9,IF(S60='Grading Scale'!B$11,'Grading Scale'!C$11,'Grading Scale'!C$13))))),IF(S60='Grading Scale'!E$3,'Grading Scale'!F$3,IF(S60='Grading Scale'!E$5,'Grading Scale'!F$5,IF(S60='Grading Scale'!E$7,'Grading Scale'!F$7,IF(S60='Grading Scale'!E$9,'Grading Scale'!F$9,IF(S60='Grading Scale'!E$11,'Grading Scale'!F$11,'Grading Scale'!F$13))))))","v":"B    "}," ",null,""]
[{"$f":"Scores!A52","v":0},{"$f":"Scores!B52","v":0},{"$f":"Scores!C52","v":0},{"$f":"Scores!D52","v":0},{"$f":"Scores!E52","v":0},{"$f":"Scores!F52","v":0},{"$f":"Scores!G52","v":0},{"$f":"Scores!H52","v":0},{"$f":"Scores!I52","v":0},{"$f":"Scores!J52","v":0},{"$f":"Scores!K52","v":0},{"$f":"Scores!L52","v":0},{"$f":"Scores!M52","v":0},{"$f":"Scores!N52","v":0},{"$f":"Scores!O52","v":0},-0.70710678118654746,2.9512994231491119,2.9512994231491119,{"$f":"IF(R61<'Grading Scale'!G$8,IF(R61<'Grading Scale'!G$13,'Grading Scale'!E$13,IF(R61<'Grading Scale'!G$12,'Grading Scale'!E$11,IF(R61<'Grading Scale'!G$11,'Grading Scale'!E$9,IF(R61<'Grading Scale'!G$10,'Grading Scale'!E$7,IF(R61<'Grading Scale'!G$9,'Grading Scale'!E$5,'Grading Scale'!E$3))))),IF(R61<'Grading Scale'!G$7,'Grading Scale'!B$13,IF(R61<'Grading Scale'!G$6,'Grading Scale'!B$11,IF(R61<'Grading Scale'!G$5,'Grading Scale'!B$9,IF(R61<'Grading Scale'!G$4,'Grading Scale'!B$7,IF(R61<'Grading Scale'!G$3,'Grading Scale'!B$5,'Grading Scale'!B$3))))))","v":3},{"$f":"Scores!B52","v":0},{"$f":"IF(S61>='Grading Scale'!B$13,IF(S61='Grading Scale'!B$3,'Grading Scale'!C$3,IF(S61='Grading Scale'!B$5,'Grading Scale'!C$5,IF(S61='Grading Scale'!B$7,'Grading Scale'!C$7,IF(S61='Grading Scale'!B$9,'Grading Scale'!C$9,IF(S61='Grading Scale'!B$11,'Grading Scale'!C$11,'Grading Scale'!C$13))))),IF(S61='Grading Scale'!E$3,'Grading Scale'!F$3,IF(S61='Grading Scale'!E$5,'Grading Scale'!F$5,IF(S61='Grading Scale'!E$7,'Grading Scale'!F$7,IF(S61='Grading Scale'!E$9,'Grading Scale'!F$9,IF(S61='Grading Scale'!E$11,'Grading Scale'!F$11,'Grading Scale'!F$13))))))","v":"B    "}," ",null,""]
[{"$f":"Scores!A53","v":0},{"$f":"Scores!B53","v":0},{"$f":"Scores!C53","v":0},{"$f":"Scores!D53","v":0},{"$f":"Scores!E53","v":0},{"$f":"Scores!F53","v":0},{"$f":"Scores!G53","v":0},{"$f":"Scores!H53","v":0},{"$f":"Scores!I53","v":0},{"$f":"Scores!J53","v":0},{"$f":"Scores!K53","v":0},{"$f":"Scores!L53","v":0},{"$f":"Scores!M53","v":0},{"$f":"Scores!N53","v":0},{"$f":"Scores!O53","v":0},-0.70710678118654746,2.9512994231491119,2.9512994231491119,{"$f":"IF(R62<'Grading Scale'!G$8,IF(R62<'Grading Scale'!G$13,'Grading Scale'!E$13,IF(R62<'Grading Scale'!G$12,'Grading Scale'!E$11,IF(R62<'Grading Scale'!G$11,'Grading Scale'!E$9,IF(R62<'Grading Scale'!G$10,'Grading Scale'!E$7,IF(R62<'Grading Scale'!G$9,'Grading Scale'!E$5,'Grading Scale'!E$3))))),IF(R62<'Grading Scale'!G$7,'Grading Scale'!B$13,IF(R62<'Grading Scale'!G$6,'Grading Scale'!B$11,IF(R62<'Grading Scale'!G$5,'Grading Scale'!B$9,IF(R62<'Grading Scale'!G$4,'Grading Scale'!B$7,IF(R62<'Grading Scale'!G$3,'Grading Scale'!B$5,'Grading Scale'!B$3))))))","v":3},{"$f":"Scores!B53","v":0},{"$f":"IF(S62>='Grading Scale'!B$13,IF(S62='Grading Scale'!B$3,'Grading Scale'!C$3,IF(S62='Grading Scale'!B$5,'Grading Scale'!C$5,IF(S62='Grading Scale'!B$7,'Grading Scale'!C$7,IF(S62='Grading Scale'!B$9,'Grading Scale'!C$9,IF(S62='Grading Scale'!B$11,'Grading Scale'!C$11,'Grading Scale'!C$13))))),IF(S62='Grading Scale'!E$3,'Grading Scale'!F$3,IF(S62='Grading Scale'!E$5,'Grading Scale'!F$5,IF(S62='Grading Scale'!E$7,'Grading Scale'!F$7,IF(S62='Grading Scale'!E$9,'Grading Scale'!F$9,IF(S62='Grading Scale'!E$11,'Grading Scale'!F$11,'Grading Scale'!F$13))))))","v":"B    "}," ",null,""]
[{"$f":"Scores!A54","v":0},{"$f":"Scores!B54","v":0},{"$f":"Scores!C54","v":0},{"$f":"Scores!D54","v":0},{"$f":"Scores!E54","v":0},{"$f":"Scores!F54","v":0},{"$f":"Scores!G54","v":0},{"$f":"Scores!H54","v":0},{"$f":"Scores!I54","v":0},{"$f":"Scores!J54","v":0},{"$f":"Scores!K54","v":0},{"$f":"Scores!L54","v":0},{"$f":"Scores!M54","v":0},{"$f":"Scores!N54","v":0},{"$f":"Scores!O54","v":0},-0.70710678118654746,2.9512994231491119,2.9512994231491119,{"$f":"IF(R63<'Grading Scale'!G$8,IF(R63<'Grading Scale'!G$13,'Grading Scale'!E$13,IF(R63<'Grading Scale'!G$12,'Grading Scale'!E$11,IF(R63<'Grading Scale'!G$11,'Grading Scale'!E$9,IF(R63<'Grading Scale'!G$10,'Grading Scale'!E$7,IF(R63<'Grading Scale'!G$9,'Grading Scale'!E$5,'Grading Scale'!E$3))))),IF(R63<'Grading Scale'!G$7,'Grading Scale'!B$13,IF(R63<'Grading Scale'!G$6,'Grading Scale'!B$11,IF(R63<'Grading Scale'!G$5,'Grading Scale'!B$9,IF(R63<'Grading Scale'!G$4,'Grading Scale'!B$7,IF(R63<'Grading Scale'!G$3,'Grading Scale'!B$5,'Grading Scale'!B$3))))))","v":3},{"$f":"Scores!B54","v":0},{"$f":"IF(S63>='Grading Scale'!B$13,IF(S63='Grading Scale'!B$3,'Grading Scale'!C$3,IF(S63='Grading Scale'!B$5,'Grading Scale'!C$5,IF(S63='Grading Scale'!B$7,'Grading Scale'!C$7,IF(S63='Grading Scale'!B$9,'Grading Scale'!C$9,IF(S63='Grading Scale'!B$11,'Grading Scale'!C$11,'Grading Scale'!C$13))))),IF(S63='Grading Scale'!E$3,'Grading Scale'!F$3,IF(S63='Grading Scale'!E$5,'Grading Scale'!F$5,IF(S63='Grading Scale'!E$7,'Grading Scale'!F$7,IF(S63='Grading Scale'!E$9,'Grading Scale'!F$9,IF(S63='Grading Scale'!E$11,'Grading Scale'!F$11,'Grading Scale'!F$13))))))","v":"B    "}," ",null,""]
[{"$f":"Scores!A55","v":0},{"$f":"Scores!B55","v":0},{"$f":"Scores!C55","v":0},{"$f":"Scores!D55","v":0},{"$f":"Scores!E55","v":0},{"$f":"Scores!F55","v":0},{"$f":"Scores!G55","v":0},{"$f":"Scores!H55","v":0},{"$f":"Scores!I55","v":0},{"$f":"Scores!J55","v":0},{"$f":"Scores!K55","v":0},{"$f":"Scores!L55","v":0},{"$f":"Scores!M55","v":0},{"$f":"Scores!N55","v":0},{"$f":"Scores!O55","v":0},-0.70710678118654746,2.9512994231491119,2.9512994231491119,{"$f":"IF(R64<'Grading Scale'!G$8,IF(R64<'Grading Scale'!G$13,'Grading Scale'!E$13,IF(R64<'Grading Scale'!G$12,'Grading Scale'!E$11,IF(R64<'Grading Scale'!G$11,'Grading Scale'!E$9,IF(R64<'Grading Scale'!G$10,'Grading Scale'!E$7,IF(R64<'Grading Scale'!G$9,'Grading Scale'!E$5,'Grading Scale'!E$3))))),IF(R64<'Grading Scale'!G$7,'Grading Scale'!B$13,IF(R64<'Grading Scale'!G$6,'Grading Scale'!B$11,IF(R64<'Grading Scale'!G$5,'Grading Scale'!B$9,IF(R64<'Grading Scale'!G$4,'Grading Scale'!B$7,IF(R64<'Grading Scale'!G$3,'Grading Scale'!B$5,'Grading Scale'!B$3))))))","v":3},{"$f":"Scores!B55","v":0},{"$f":"IF(S64>='Grading Scale'!B$13,IF(S64='Grading Scale'!B$3,'Grading Scale'!C$3,IF(S64='Grading Scale'!B$5,'Grading Scale'!C$5,IF(S64='Grading Scale'!B$7,'Grading Scale'!C$7,IF(S64='Grading Scale'!B$9,'Grading Scale'!C$9,IF(S64='Grading Scale'!B$11,'Grading Scale'!C$11,'Grading Scale'!C$13))))),IF(S64='Grading Scale'!E$3,'Grading Scale'!F$3,IF(S64='Grading Scale'!E$5,'Grading Scale'!F$5,IF(S64='Grading Scale'!E$7,'Grading Scale'!F$7,IF(S64='Grading Scale'!E$9,'Grading Scale'!F$9,IF(S64='Grading Scale'!E$11,'Grading Scale'!F$11,'Grading Scale'!F$13))))))","v":"B    "}," ",null,""]
[{"$f":"Scores!A56","v":0},{"$f":"Scores!B56","v":0},{"$f":"Scores!C56","v":0},{"$f":"Scores!D56","v":0},{"$f":"Scores!E56","v":0},{"$f":"Scores!F56","v":0},{"$f":"Scores!G56","v":0},{"$f":"Scores!H56","v":0},{"$f":"Scores!I56","v":0},{"$f":"Scores!J56","v":0},{"$f":"Scores!K56","v":0},{"$f":"Scores!L56","v":0},{"$f":"Scores!M56","v":0},{"$f":"Scores!N56","v":0},{"$f":"Scores!O56","v":0},-0.70710678118654746,2.9512994231491119,2.9512994231491119,{"$f":"IF(R65<'Grading Scale'!G$8,IF(R65<'Grading Scale'!G$13,'Grading Scale'!E$13,IF(R65<'Grading Scale'!G$12,'Grading Scale'!E$11,IF(R65<'Grading Scale'!G$11,'Grading Scale'!E$9,IF(R65<'Grading Scale'!G$10,'Grading Scale'!E$7,IF(R65<'Grading Scale'!G$9,'Grading Scale'!E$5,'Grading Scale'!E$3))))),IF(R65<'Grading Scale'!G$7,'Grading Scale'!B$13,IF(R65<'Grading Scale'!G$6,'Grading Scale'!B$11,IF(R65<'Grading Scale'!G$5,'Grading Scale'!B$9,IF(R65<'Grading Scale'!G$4,'Grading Scale'!B$7,IF(R65<'Grading Scale'!G$3,'Grading Scale'!B$5,'Grading Scale'!B$3))))))","v":3},{"$f":"Scores!B56","v":0},{"$f":"IF(S65>='Grading Scale'!B$13,IF(S65='Grading Scale'!B$3,'Grading Scale'!C$3,IF(S65='Grading Scale'!B$5,'Grading Scale'!C$5,IF(S65='Grading Scale'!B$7,'Grading Scale'!C$7,IF(S65='Grading Scale'!B$9,'Grading Scale'!C$9,IF(S65='Grading Scale'!B$11,'Grading Scale'!C$11,'Grading Scale'!C$13))))),IF(S65='Grading Scale'!E$3,'Grading Scale'!F$3,IF(S65='Grading Scale'!E$5,'Grading Scale'!F$5,IF(S65='Grading Scale'!E$7,'Grading Scale'!F$7,IF(S65='Grading Scale'!E$9,'Grading Scale'!F$9,IF(S65='Grading Scale'!E$11,'Grading Scale'!F$11,'Grading Scale'!F$13))))))","v":"B    "}," ",null,""]
[{"$f":"Scores!A57","v":0},{"$f":"Scores!B57","v":0},{"$f":"Scores!C57","v":0},{"$f":"Scores!D57","v":0},{"$f":"Scores!E57","v":0},{"$f":"Scores!F57","v":0},{"$f":"Scores!G57","v":0},{"$f":"Scores!H57","v":0},{"$f":"Scores!I57","v":0},{"$f":"Scores!J57","v":0},{"$f":"Scores!K57","v":0},{"$f":"Scores!L57","v":0},{"$f":"Scores!M57","v":0},{"$f":"Scores!N57","v":0},{"$f":"Scores!O57","v":0},-0.70710678118654746,2.9512994231491119,2.9512994231491119,{"$f":"IF(R66<'Grading Scale'!G$8,IF(R66<'Grading Scale'!G$13,'Grading Scale'!E$13,IF(R66<'Grading Scale'!G$12,'Grading Scale'!E$11,IF(R66<'Grading Scale'!G$11,'Grading Scale'!E$9,IF(R66<'Grading Scale'!G$10,'Grading Scale'!E$7,IF(R66<'Grading Scale'!G$9,'Grading Scale'!E$5,'Grading Scale'!E$3))))),IF(R66<'Grading Scale'!G$7,'Grading Scale'!B$13,IF(R66<'Grading Scale'!G$6,'Grading Scale'!B$11,IF(R66<'Grading Scale'!G$5,'Grading Scale'!B$9,IF(R66<'Grading Scale'!G$4,'Grading Scale'!B$7,IF(R66<'Grading Scale'!G$3,'Grading Scale'!B$5,'Grading Scale'!B$3))))))","v":3},{"$f":"Scores!B57","v":0},{"$f":"IF(S66>='Grading Scale'!B$13,IF(S66='Grading Scale'!B$3,'Grading Scale'!C$3,IF(S66='Grading Scale'!B$5,'Grading Scale'!C$5,IF(S66='Grading Scale'!B$7,'Grading Scale'!C$7,IF(S66='Grading Scale'!B$9,'Grading Scale'!C$9,IF(S66='Grading Scale'!B$11,'Grading Scale'!C$11,'Grading Scale'!C$13))))),IF(S66='Grading Scale'!E$3,'Grading Scale'!F$3,IF(S66='Grading Scale'!E$5,'Grading Scale'!F$5,IF(S66='Grading Scale'!E$7,'Grading Scale'!F$7,IF(S66='Grading Scale'!E$9,'Grading Scale'!F$9,IF(S66='Grading Scale'!E$11,'Grading Scale'!F$11,'Grading Scale'!F$13))))))","v":"B    "}," ",null,""]
[{"$f":"Scores!A58","v":0},{"$f":"Scores!B58","v":0},{"$f":"Scores!C58","v":0},{"$f":"Scores!D58","v":0},{"$f":"Scores!E58","v":0},{"$f":"Scores!F58","v":0},{"$f":"Scores!G58","v":0},{"$f":"Scores!H58","v":0},{"$f":"Scores!I58","v":0},{"$f":"Scores!J58","v":0},{"$f":"Scores!K58","v":0},{"$f":"Scores!L58","v":0},{"$f":"Scores!M58","v":0},{"$f":"Scores!N58","v":0},{"$f":"Scores!O58","v":0},-0.70710678118654746,2.9512994231491119,2.9512994231491119,{"$f":"IF(R67<'Grading Scale'!G$8,IF(R67<'Grading Scale'!G$13,'Grading Scale'!E$13,IF(R67<'Grading Scale'!G$12,'Grading Scale'!E$11,IF(R67<'Grading Scale'!G$11,'Grading Scale'!E$9,IF(R67<'Grading Scale'!G$10,'Grading Scale'!E$7,IF(R67<'Grading Scale'!G$9,'Grading Scale'!E$5,'Grading Scale'!E$3))))),IF(R67<'Grading Scale'!G$7,'Grading Scale'!B$13,IF(R67<'Grading Scale'!G$6,'Grading Scale'!B$11,IF(R67<'Grading Scale'!G$5,'Grading Scale'!B$9,IF(R67<'Grading Scale'!G$4,'Grading Scale'!B$7,IF(R67<'Grading Scale'!G$3,'Grading Scale'!B$5,'Grading Scale'!B$3))))))","v":3},{"$f":"Scores!B58","v":0},{"$f":"IF(S67>='Grading Scale'!B$13,IF(S67='Grading Scale'!B$3,'Grading Scale'!C$3,IF(S67='Grading Scale'!B$5,'Grading Scale'!C$5,IF(S67='Grading Scale'!B$7,'Grading Scale'!C$7,IF(S67='Grading Scale'!B$9,'Grading Scale'!C$9,IF(S67='Grading Scale'!B$11,'Grading Scale'!C$11,'Grading Scale'!C$13))))),IF(S67='Grading Scale'!E$3,'Grading Scale'!F$3,IF(S67='Grading Scale'!E$5,'Grading Scale'!F$5,IF(S67='Grading Scale'!E$7,'Grading Scale'!F$7,IF(S67='Grading Scale'!E$9,'Grading Scale'!F$9,IF(S67='Grading Scale'!E$11,'Grading Scale'!F$11,'Grading Scale'!F$13))))))","v":"B    "}," ",null,""]
[{"$f":"Scores!A59","v":0},{"$f":"Scores!B59","v":0},{"$f":"Scores!C59","v":0},{"$f":"Scores!D59","v":0},{"$f":"Scores!E59","v":0},{"$f":"Scores!F59","v":0},{"$f":"Scores!G59","v":0},{"$f":"Scores!H59","v":0},{"$f":"Scores!I59","v":0},{"$f":"Scores!J59","v":0},{"$f":"Scores!K59","v":0},{"$f":"Scores!L59","v":0},{"$f":"Scores!M59","v":0},{"$f":"Scores!N59","v":0},{"$f":"Scores!O59","v":0},-0.70710678118654746,2.9512994231491119,2.9512994231491119,{"$f":"IF(R68<'Grading Scale'!G$8,IF(R68<'Grading Scale'!G$13,'Grading Scale'!E$13,IF(R68<'Grading Scale'!G$12,'Grading Scale'!E$11,IF(R68<'Grading Scale'!G$11,'Grading Scale'!E$9,IF(R68<'Grading Scale'!G$10,'Grading Scale'!E$7,IF(R68<'Grading Scale'!G$9,'Grading Scale'!E$5,'Grading Scale'!E$3))))),IF(R68<'Grading Scale'!G$7,'Grading Scale'!B$13,IF(R68<'Grading Scale'!G$6,'Grading Scale'!B$11,IF(R68<'Grading Scale'!G$5,'Grading Scale'!B$9,IF(R68<'Grading Scale'!G$4,'Grading Scale'!B$7,IF(R68<'Grading Scale'!G$3,'Grading Scale'!B$5,'Grading Scale'!B$3))))))","v":3},{"$f":"Scores!B59","v":0},{"$f":"IF(S68>='Grading Scale'!B$13,IF(S68='Grading Scale'!B$3,'Grading Scale'!C$3,IF(S68='Grading Scale'!B$5,'Grading Scale'!C$5,IF(S68='Grading Scale'!B$7,'Grading Scale'!C$7,IF(S68='Grading Scale'!B$9,'Grading Scale'!C$9,IF(S68='Grading Scale'!B$11,'Grading Scale'!C$11,'Grading Scale'!C$13))))),IF(S68='Grading Scale'!E$3,'Grading Scale'!F$3,IF(S68='Grading Scale'!E$5,'Grading Scale'!F$5,IF(S68='Grading Scale'!E$7,'Grading Scale'!F$7,IF(S68='Grading Scale'!E$9,'Grading Scale'!F$9,IF(S68='Grading Scale'!E$11,'Grading Scale'!F$11,'Grading Scale'!F$13))))))","v":"B    "}," ",null,""]
[{"$f":"Scores!A60","v":0},{"$f":"Scores!B60","v":0},{"$f":"Scores!C60","v":0},{"$f":"Scores!D60","v":0},{"$f":"Scores!E60","v":0},{"$f":"Scores!F60","v":0},{"$f":"Scores!G60","v":0},{"$f":"Scores!H60","v":0},{"$f":"Scores!I60","v":0},{"$f":"Scores!J60","v":0},{"$f":"Scores!K60","v":0},{"$f":"Scores!L60","v":0},{"$f":"Scores!M60","v":0},{"$f":"Scores!N60","v":0},{"$f":"Scores!O60","v":0},-0.70710678118654746,2.9512994231491119,2.9512994231491119,{"$f":"IF(R69<'Grading Scale'!G$8,IF(R69<'Grading Scale'!G$13,'Grading Scale'!E$13,IF(R69<'Grading Scale'!G$12,'Grading Scale'!E$11,IF(R69<'Grading Scale'!G$11,'Grading Scale'!E$9,IF(R69<'Grading Scale'!G$10,'Grading Scale'!E$7,IF(R69<'Grading Scale'!G$9,'Grading Scale'!E$5,'Grading Scale'!E$3))))),IF(R69<'Grading Scale'!G$7,'Grading Scale'!B$13,IF(R69<'Grading Scale'!G$6,'Grading Scale'!B$11,IF(R69<'Grading Scale'!G$5,'Grading Scale'!B$9,IF(R69<'Grading Scale'!G$4,'Grading Scale'!B$7,IF(R69<'Grading Scale'!G$3,'Grading Scale'!B$5,'Grading Scale'!B$3))))))","v":3},{"$f":"Scores!B60","v":0},{"$f":"IF(S69>='Grading Scale'!B$13,IF(S69='Grading Scale'!B$3,'Grading Scale'!C$3,IF(S69='Grading Scale'!B$5,'Grading Scale'!C$5,IF(S69='Grading Scale'!B$7,'Grading Scale'!C$7,IF(S69='Grading Scale'!B$9,'Grading Scale'!C$9,IF(S69='Grading Scale'!B$11,'Grading Scale'!C$11,'Grading Scale'!C$13))))),IF(S69='Grading Scale'!E$3,'Grading Scale'!F$3,IF(S69='Grading Scale'!E$5,'Grading Scale'!F$5,IF(S69='Grading Scale'!E$7,'Grading Scale'!F$7,IF(S69='Grading Scale'!E$9,'Grading Scale'!F$9,IF(S69='Grading Scale'!E$11,'Grading Scale'!F$11,'Grading Scale'!F$13))))))","v":"B    "}," ",null,""]
[{"$f":"Scores!A61","v":0},{"$f":"Scores!B61","v":0},{"$f":"Scores!C61","v":0},{"$f":"Scores!D61","v":0},{"$f":"Scores!E61","v":0},{"$f":"Scores!F61","v":0},{"$f":"Scores!G61","v":0},{"$f":"Scores!H61","v":0},{"$f":"Scores!I61","v":0},{"$f":"Scores!J61","v":0},{"$f":"Scores!K61","v":0},{"$f":"Scores!L61","v":0},{"$f":"Scores!M61","v":0},{"$f":"Scores!N61","v":0},{"$f":"Scores!O61","v":0},-0.70710678118654746,2.9512994231491119,2.9512994231491119,{"$f":"IF(R70<'Grading Scale'!G$8,IF(R70<'Grading Scale'!G$13,'Grading Scale'!E$13,IF(R70<'Grading Scale'!G$12,'Grading Scale'!E$11,IF(R70<'Grading Scale'!G$11,'Grading Scale'!E$9,IF(R70<'Grading Scale'!G$10,'Grading Scale'!E$7,IF(R70<'Grading Scale'!G$9,'Grading Scale'!E$5,'Grading Scale'!E$3))))),IF(R70<'Grading Scale'!G$7,'Grading Scale'!B$13,IF(R70<'Grading Scale'!G$6,'Grading Scale'!B$11,IF(R70<'Grading Scale'!G$5,'Grading Scale'!B$9,IF(R70<'Grading Scale'!G$4,'Grading Scale'!B$7,IF(R70<'Grading Scale'!G$3,'Grading Scale'!B$5,'Grading Scale'!B$3))))))","v":3},{"$f":"Scores!B61","v":0},{"$f":"IF(S70>='Grading Scale'!B$13,IF(S70='Grading Scale'!B$3,'Grading Scale'!C$3,IF(S70='Grading Scale'!B$5,'Grading Scale'!C$5,IF(S70='Grading Scale'!B$7,'Grading Scale'!C$7,IF(S70='Grading Scale'!B$9,'Grading Scale'!C$9,IF(S70='Grading Scale'!B$11,'Grading Scale'!C$11,'Grading Scale'!C$13))))),IF(S70='Grading Scale'!E$3,'Grading Scale'!F$3,IF(S70='Grading Scale'!E$5,'Grading Scale'!F$5,IF(S70='Grading Scale'!E$7,'Grading Scale'!F$7,IF(S70='Grading Scale'!E$9,'Grading Scale'!F$9,IF(S70='Grading Scale'!E$11,'Grading Scale'!F$11,'Grading Scale'!F$13))))))","v":"B    "}," ",null,""]
[{"$f":"Scores!A62","v":0},{"$f":"Scores!B62","v":0},{"$f":"Scores!C62","v":0},{"$f":"Scores!D62","v":0},{"$f":"Scores!E62","v":0},{"$f":"Scores!F62","v":0},{"$f":"Scores!G62","v":0},{"$f":"Scores!H62","v":0},{"$f":"Scores!I62","v":0},{"$f":"Scores!J62","v":0},{"$f":"Scores!K62","v":0},{"$f":"Scores!L62","v":0},{"$f":"Scores!M62","v":0},{"$f":"Scores!N62","v":0},{"$f":"Scores!O62","v":0},-0.70710678118654746,2.9512994231491119,2.9512994231491119,{"$f":"IF(R71<'Grading Scale'!G$8,IF(R71<'Grading Scale'!G$13,'Grading Scale'!E$13,IF(R71<'Grading Scale'!G$12,'Grading Scale'!E$11,IF(R71<'Grading Scale'!G$11,'Grading Scale'!E$9,IF(R71<'Grading Scale'!G$10,'Grading Scale'!E$7,IF(R71<'Grading Scale'!G$9,'Grading Scale'!E$5,'Grading Scale'!E$3))))),IF(R71<'Grading Scale'!G$7,'Grading Scale'!B$13,IF(R71<'Grading Scale'!G$6,'Grading Scale'!B$11,IF(R71<'Grading Scale'!G$5,'Grading Scale'!B$9,IF(R71<'Grading Scale'!G$4,'Grading Scale'!B$7,IF(R71<'Grading Scale'!G$3,'Grading Scale'!B$5,'Grading Scale'!B$3))))))","v":3},{"$f":"Scores!B62","v":0},{"$f":"IF(S71>='Grading Scale'!B$13,IF(S71='Grading Scale'!B$3,'Grading Scale'!C$3,IF(S71='Grading Scale'!B$5,'Grading Scale'!C$5,IF(S71='Grading Scale'!B$7,'Grading Scale'!C$7,IF(S71='Grading Scale'!B$9,'Grading Scale'!C$9,IF(S71='Grading Scale'!B$11,'Grading Scale'!C$11,'Grading Scale'!C$13))))),IF(S71='Grading Scale'!E$3,'Grading Scale'!F$3,IF(S71='Grading Scale'!E$5,'Grading Scale'!F$5,IF(S71='Grading Scale'!E$7,'Grading Scale'!F$7,IF(S71='Grading Scale'!E$9,'Grading Scale'!F$9,IF(S71='Grading Scale'!E$11,'Grading Scale'!F$11,'Grading Scale'!F$13))))))","v":"B    "}," ",null,""]
[{"$f":"Scores!A63","v":0},{"$f":"Scores!B63","v":0},{"$f":"Scores!C63","v":0},{"$f":"Scores!D63","v":0},{"$f":"Scores!E63","v":0},{"$f":"Scores!F63","v":0},{"$f":"Scores!G63","v":0},{"$f":"Scores!H63","v":0},{"$f":"Scores!I63","v":0},{"$f":"Scores!J63","v":0},{"$f":"Scores!K63","v":0},{"$f":"Scores!L63","v":0},{"$f":"Scores!M63","v":0},{"$f":"Scores!N63","v":0},{"$f":"Scores!O63","v":0},-0.70710678118654746,2.9512994231491119,2.9512994231491119,{"$f":"IF(R72<'Grading Scale'!G$8,IF(R72<'Grading Scale'!G$13,'Grading Scale'!E$13,IF(R72<'Grading Scale'!G$12,'Grading Scale'!E$11,IF(R72<'Grading Scale'!G$11,'Grading Scale'!E$9,IF(R72<'Grading Scale'!G$10,'Grading Scale'!E$7,IF(R72<'Grading Scale'!G$9,'Grading Scale'!E$5,'Grading Scale'!E$3))))),IF(R72<'Grading Scale'!G$7,'Grading Scale'!B$13,IF(R72<'Grading Scale'!G$6,'Grading Scale'!B$11,IF(R72<'Grading Scale'!G$5,'Grading Scale'!B$9,IF(R72<'Grading Scale'!G$4,'Grading Scale'!B$7,IF(R72<'Grading Scale'!G$3,'Grading Scale'!B$5,'Grading Scale'!B$3))))))","v":3},{"$f":"Scores!B63","v":0},{"$f":"IF(S72>='Grading Scale'!B$13,IF(S72='Grading Scale'!B$3,'Grading Scale'!C$3,IF(S72='Grading Scale'!B$5,'Grading Scale'!C$5,IF(S72='Grading Scale'!B$7,'Grading Scale'!C$7,IF(S72='Grading Scale'!B$9,'Grading Scale'!C$9,IF(S72='Grading Scale'!B$11,'Grading Scale'!C$11,'Grading Scale'!C$13))))),IF(S72='Grading Scale'!E$3,'Grading Scale'!F$3,IF(S72='Grading Scale'!E$5,'Grading Scale'!F$5,IF(S72='Grading Scale'!E$7,'Grading Scale'!F$7,IF(S72='Grading Scale'!E$9,'Grading Scale'!F$9,IF(S72='Grading Scale'!E$11,'Grading Scale'!F$11,'Grading Scale'!F$13))))))","v":"B    "}," ",null,""]
[{"$f":"Scores!A64","v":0},{"$f":"Scores!B64","v":0},{"$f":"Scores!C64","v":0},{"$f":"Scores!D64","v":0},{"$f":"Scores!E64","v":0},{"$f":"Scores!F64","v":0},{"$f":"Scores!G64","v":0},{"$f":"Scores!H64","v":0},{"$f":"Scores!I64","v":0},{"$f":"Scores!J64","v":0},{"$f":"Scores!K64","v":0},{"$f":"Scores!L64","v":0},{"$f":"Scores!M64","v":0},{"$f":"Scores!N64","v":0},{"$f":"Scores!O64","v":0},-0.70710678118654746,2.9512994231491119,2.9512994231491119,{"$f":"IF(R73<'Grading Scale'!G$8,IF(R73<'Grading Scale'!G$13,'Grading Scale'!E$13,IF(R73<'Grading Scale'!G$12,'Grading Scale'!E$11,IF(R73<'Grading Scale'!G$11,'Grading Scale'!E$9,IF(R73<'Grading Scale'!G$10,'Grading Scale'!E$7,IF(R73<'Grading Scale'!G$9,'Grading Scale'!E$5,'Grading Scale'!E$3))))),IF(R73<'Grading Scale'!G$7,'Grading Scale'!B$13,IF(R73<'Grading Scale'!G$6,'Grading Scale'!B$11,IF(R73<'Grading Scale'!G$5,'Grading Scale'!B$9,IF(R73<'Grading Scale'!G$4,'Grading Scale'!B$7,IF(R73<'Grading Scale'!G$3,'Grading Scale'!B$5,'Grading Scale'!B$3))))))","v":3},{"$f":"Scores!B64","v":0},{"$f":"IF(S73>='Grading Scale'!B$13,IF(S73='Grading Scale'!B$3,'Grading Scale'!C$3,IF(S73='Grading Scale'!B$5,'Grading Scale'!C$5,IF(S73='Grading Scale'!B$7,'Grading Scale'!C$7,IF(S73='Grading Scale'!B$9,'Grading Scale'!C$9,IF(S73='Grading Scale'!B$11,'Grading Scale'!C$11,'Grading Scale'!C$13))))),IF(S73='Grading Scale'!E$3,'Grading Scale'!F$3,IF(S73='Grading Scale'!E$5,'Grading Scale'!F$5,IF(S73='Grading Scale'!E$7,'Grading Scale'!F$7,IF(S73='Grading Scale'!E$9,'Grading Scale'!F$9,IF(S73='Grading Scale'!E$11,'Grading Scale'!F$11,'Grading Scale'!F$13))))))","v":"B    "}," ",null,""]
[{"$f":"Scores!A65","v":0},{"$f":"Scores!B65","v":0},{"$f":"Scores!C65","v":0},{"$f":"Scores!D65","v":0},{"$f":"Scores!E65","v":0},{"$f":"Scores!F65","v":0},{"$f":"Scores!G65","v":0},{"$f":"Scores!H65","v":0},{"$f":"Scores!I65","v":0},{"$f":"Scores!J65","v":0},{"$f":"Scores!K65","v":0},{"$f":"Scores!L65","v":0},{"$f":"Scores!M65","v":0},{"$f":"Scores!N65","v":0},{"$f":"Scores!O65","v":0},-0.70710678118654746,2.9512994231491119,2.9512994231491119,{"$f":"IF(R74<'Grading Scale'!G$8,IF(R74<'Grading Scale'!G$13,'Grading Scale'!E$13,IF(R74<'Grading Scale'!G$12,'Grading Scale'!E$11,IF(R74<'Grading Scale'!G$11,'Grading Scale'!E$9,IF(R74<'Grading Scale'!G$10,'Grading Scale'!E$7,IF(R74<'Grading Scale'!G$9,'Grading Scale'!E$5,'Grading Scale'!E$3))))),IF(R74<'Grading Scale'!G$7,'Grading Scale'!B$13,IF(R74<'Grading Scale'!G$6,'Grading Scale'!B$11,IF(R74<'Grading Scale'!G$5,'Grading Scale'!B$9,IF(R74<'Grading Scale'!G$4,'Grading Scale'!B$7,IF(R74<'Grading Scale'!G$3,'Grading Scale'!B$5,'Grading Scale'!B$3))))))","v":3},{"$f":"Scores!B65","v":0},{"$f":"IF(S74>='Grading Scale'!B$13,IF(S74='Grading Scale'!B$3,'Grading Scale'!C$3,IF(S74='Grading Scale'!B$5,'Grading Scale'!C$5,IF(S74='Grading Scale'!B$7,'Grading Scale'!C$7,IF(S74='Grading Scale'!B$9,'Grading Scale'!C$9,IF(S74='Grading Scale'!B$11,'Grading Scale'!C$11,'Grading Scale'!C$13))))),IF(S74='Grading Scale'!E$3,'Grading Scale'!F$3,IF(S74='Grading Scale'!E$5,'Grading Scale'!F$5,IF(S74='Grading Scale'!E$7,'Grading Scale'!F$7,IF(S74='Grading Scale'!E$9,'Grading Scale'!F$9,IF(S74='Grading Scale'!E$11,'Grading Scale'!F$11,'Grading Scale'!F$13))))))","v":"B    "}," ",null,""]
[{"$f":"Scores!A66","v":0},{"$f":"Scores!B66","v":0},{"$f":"Scores!C66","v":0},{"$f":"Scores!D66","v":0},{"$f":"Scores!E66","v":0},{"$f":"Scores!F66","v":0},{"$f":"Scores!G66","v":0},{"$f":"Scores!H66","v":0},{"$f":"Scores!I66","v":0},{"$f":"Scores!J66","v":0},{"$f":"Scores!K66","v":0},{"$f":"Scores!L66","v":0},{"$f":"Scores!M66","v":0},{"$f":"Scores!N66","v":0},{"$f":"Scores!O66","v":0},-0.70710678118654746,2.9512994231491119,2.9512994231491119,{"$f":"IF(R75<'Grading Scale'!G$8,IF(R75<'Grading Scale'!G$13,'Grading Scale'!E$13,IF(R75<'Grading Scale'!G$12,'Grading Scale'!E$11,IF(R75<'Grading Scale'!G$11,'Grading Scale'!E$9,IF(R75<'Grading Scale'!G$10,'Grading Scale'!E$7,IF(R75<'Grading Scale'!G$9,'Grading Scale'!E$5,'Grading Scale'!E$3))))),IF(R75<'Grading Scale'!G$7,'Grading Scale'!B$13,IF(R75<'Grading Scale'!G$6,'Grading Scale'!B$11,IF(R75<'Grading Scale'!G$5,'Grading Scale'!B$9,IF(R75<'Grading Scale'!G$4,'Grading Scale'!B$7,IF(R75<'Grading Scale'!G$3,'Grading Scale'!B$5,'Grading Scale'!B$3))))))","v":3},{"$f":"Scores!B66","v":0},{"$f":"IF(S75>='Grading Scale'!B$13,IF(S75='Grading Scale'!B$3,'Grading Scale'!C$3,IF(S75='Grading Scale'!B$5,'Grading Scale'!C$5,IF(S75='Grading Scale'!B$7,'Grading Scale'!C$7,IF(S75='Grading Scale'!B$9,'Grading Scale'!C$9,IF(S75='Grading Scale'!B$11,'Grading Scale'!C$11,'Grading Scale'!C$13))))),IF(S75='Grading Scale'!E$3,'Grading Scale'!F$3,IF(S75='Grading Scale'!E$5,'Grading Scale'!F$5,IF(S75='Grading Scale'!E$7,'Grading Scale'!F$7,IF(S75='Grading Scale'!E$9,'Grading Scale'!F$9,IF(S75='Grading Scale'!E$11,'Grading Scale'!F$11,'Grading Scale'!F$13))))))","v":"B    "}," ",null,""]
[{"$f":"Scores!A67","v":0},{"$f":"Scores!B67","v":0},{"$f":"Scores!C67","v":0},{"$f":"Scores!D67","v":0},{"$f":"Scores!E67","v":0},{"$f":"Scores!F67","v":0},{"$f":"Scores!G67","v":0},{"$f":"Scores!H67","v":0},{"$f":"Scores!I67","v":0},{"$f":"Scores!J67","v":0},{"$f":"Scores!K67","v":0},{"$f":"Scores!L67","v":0},{"$f":"Scores!M67","v":0},{"$f":"Scores!N67","v":0},{"$f":"Scores!O67","v":0},-0.70710678118654746,2.9512994231491119,2.9512994231491119,{"$f":"IF(R76<'Grading Scale'!G$8,IF(R76<'Grading Scale'!G$13,'Grading Scale'!E$13,IF(R76<'Grading Scale'!G$12,'Grading Scale'!E$11,IF(R76<'Grading Scale'!G$11,'Grading Scale'!E$9,IF(R76<'Grading Scale'!G$10,'Grading Scale'!E$7,IF(R76<'Grading Scale'!G$9,'Grading Scale'!E$5,'Grading Scale'!E$3))))),IF(R76<'Grading Scale'!G$7,'Grading Scale'!B$13,IF(R76<'Grading Scale'!G$6,'Grading Scale'!B$11,IF(R76<'Grading Scale'!G$5,'Grading Scale'!B$9,IF(R76<'Grading Scale'!G$4,'Grading Scale'!B$7,IF(R76<'Grading Scale'!G$3,'Grading Scale'!B$5,'Grading Scale'!B$3))))))","v":3},{"$f":"Scores!B67","v":0},{"$f":"IF(S76>='Grading Scale'!B$13,IF(S76='Grading Scale'!B$3,'Grading Scale'!C$3,IF(S76='Grading Scale'!B$5,'Grading Scale'!C$5,IF(S76='Grading Scale'!B$7,'Grading Scale'!C$7,IF(S76='Grading Scale'!B$9,'Grading Scale'!C$9,IF(S76='Grading Scale'!B$11,'Grading Scale'!C$11,'Grading Scale'!C$13))))),IF(S76='Grading Scale'!E$3,'Grading Scale'!F$3,IF(S76='Grading Scale'!E$5,'Grading Scale'!F$5,IF(S76='Grading Scale'!E$7,'Grading Scale'!F$7,IF(S76='Grading Scale'!E$9,'Grading Scale'!F$9,IF(S76='Grading Scale'!E$11,'Grading Scale'!F$11,'Grading Scale'!F$13))))))","v":"B    "}," ",null,""]
[{"$f":"Scores!A68","v":0},{"$f":"Scores!B68","v":0},{"$f":"Scores!C68","v":0},{"$f":"Scores!D68","v":0},{"$f":"Scores!E68","v":0},{"$f":"Scores!F68","v":0},{"$f":"Scores!G68","v":0},{"$f":"Scores!H68","v":0},{"$f":"Scores!I68","v":0},{"$f":"Scores!J68","v":0},{"$f":"Scores!K68","v":0},{"$f":"Scores!L68","v":0},{"$f":"Scores!M68","v":0},{"$f":"Scores!N68","v":0},{"$f":"Scores!O68","v":0},-0.70710678118654746,2.9512994231491119,2.9512994231491119,{"$f":"IF(R77<'Grading Scale'!G$8,IF(R77<'Grading Scale'!G$13,'Grading Scale'!E$13,IF(R77<'Grading Scale'!G$12,'Grading Scale'!E$11,IF(R77<'Grading Scale'!G$11,'Grading Scale'!E$9,IF(R77<'Grading Scale'!G$10,'Grading Scale'!E$7,IF(R77<'Grading Scale'!G$9,'Grading Scale'!E$5,'Grading Scale'!E$3))))),IF(R77<'Grading Scale'!G$7,'Grading Scale'!B$13,IF(R77<'Grading Scale'!G$6,'Grading Scale'!B$11,IF(R77<'Grading Scale'!G$5,'Grading Scale'!B$9,IF(R77<'Grading Scale'!G$4,'Grading Scale'!B$7,IF(R77<'Grading Scale'!G$3,'Grading Scale'!B$5,'Grading Scale'!B$3))))))","v":3},{"$f":"Scores!B68","v":0},{"$f":"IF(S77>='Grading Scale'!B$13,IF(S77='Grading Scale'!B$3,'Grading Scale'!C$3,IF(S77='Grading Scale'!B$5,'Grading Scale'!C$5,IF(S77='Grading Scale'!B$7,'Grading Scale'!C$7,IF(S77='Grading Scale'!B$9,'Grading Scale'!C$9,IF(S77='Grading Scale'!B$11,'Grading Scale'!C$11,'Grading Scale'!C$13))))),IF(S77='Grading Scale'!E$3,'Grading Scale'!F$3,IF(S77='Grading Scale'!E$5,'Grading Scale'!F$5,IF(S77='Grading Scale'!E$7,'Grading Scale'!F$7,IF(S77='Grading Scale'!E$9,'Grading Scale'!F$9,IF(S77='Grading Scale'!E$11,'Grading Scale'!F$11,'Grading Scale'!F$13))))))","v":"B    "}," ",null,""]
[{"$f":"Scores!A69","v":0},{"$f":"Scores!B69","v":0},{"$f":"Scores!C69","v":0},{"$f":"Scores!D69","v":0},{"$f":"Scores!E69","v":0},{"$f":"Scores!F69","v":0},{"$f":"Scores!G69","v":0},{"$f":"Scores!H69","v":0},{"$f":"Scores!I69","v":0},{"$f":"Scores!J69","v":0},{"$f":"Scores!K69","v":0},{"$f":"Scores!L69","v":0},{"$f":"Scores!M69","v":0},{"$f":"Scores!N69","v":0},{"$f":"Scores!O69","v":0},-0.70710678118654746,2.9512994231491119,2.9512994231491119,{"$f":"IF(R78<'Grading Scale'!G$8,IF(R78<'Grading Scale'!G$13,'Grading Scale'!E$13,IF(R78<'Grading Scale'!G$12,'Grading Scale'!E$11,IF(R78<'Grading Scale'!G$11,'Grading Scale'!E$9,IF(R78<'Grading Scale'!G$10,'Grading Scale'!E$7,IF(R78<'Grading Scale'!G$9,'Grading Scale'!E$5,'Grading Scale'!E$3))))),IF(R78<'Grading Scale'!G$7,'Grading Scale'!B$13,IF(R78<'Grading Scale'!G$6,'Grading Scale'!B$11,IF(R78<'Grading Scale'!G$5,'Grading Scale'!B$9,IF(R78<'Grading Scale'!G$4,'Grading Scale'!B$7,IF(R78<'Grading Scale'!G$3,'Grading Scale'!B$5,'Grading Scale'!B$3))))))","v":3},{"$f":"Scores!B69","v":0},{"$f":"IF(S78>='Grading Scale'!B$13,IF(S78='Grading Scale'!B$3,'Grading Scale'!C$3,IF(S78='Grading Scale'!B$5,'Grading Scale'!C$5,IF(S78='Grading Scale'!B$7,'Grading Scale'!C$7,IF(S78='Grading Scale'!B$9,'Grading Scale'!C$9,IF(S78='Grading Scale'!B$11,'Grading Scale'!C$11,'Grading Scale'!C$13))))),IF(S78='Grading Scale'!E$3,'Grading Scale'!F$3,IF(S78='Grading Scale'!E$5,'Grading Scale'!F$5,IF(S78='Grading Scale'!E$7,'Grading Scale'!F$7,IF(S78='Grading Scale'!E$9,'Grading Scale'!F$9,IF(S78='Grading Scale'!E$11,'Grading Scale'!F$11,'Grading Scale'!F$13))))))","v":"B    "}," ",null,""]
[{"$f":"Scores!A70","v":0},{"$f":"Scores!B70","v":0},{"$f":"Scores!C70","v":0},{"$f":"Scores!D70","v":0},{"$f":"Scores!E70","v":0},{"$f":"Scores!F70","v":0},{"$f":"Scores!G70","v":0},{"$f":"Scores!H70","v":0},{"$f":"Scores!I70","v":0},{"$f":"Scores!J70","v":0},{"$f":"Scores!K70","v":0},{"$f":"Scores!L70","v":0},{"$f":"Scores!M70","v":0},{"$f":"Scores!N70","v":0},{"$f":"Scores!O70","v":0},-0.70710678118654746,2.9512994231491119,2.9512994231491119,{"$f":"IF(R79<'Grading Scale'!G$8,IF(R79<'Grading Scale'!G$13,'Grading Scale'!E$13,IF(R79<'Grading Scale'!G$12,'Grading Scale'!E$11,IF(R79<'Grading Scale'!G$11,'Grading Scale'!E$9,IF(R79<'Grading Scale'!G$10,'Grading Scale'!E$7,IF(R79<'Grading Scale'!G$9,'Grading Scale'!E$5,'Grading Scale'!E$3))))),IF(R79<'Grading Scale'!G$7,'Grading Scale'!B$13,IF(R79<'Grading Scale'!G$6,'Grading Scale'!B$11,IF(R79<'Grading Scale'!G$5,'Grading Scale'!B$9,IF(R79<'Grading Scale'!G$4,'Grading Scale'!B$7,IF(R79<'Grading Scale'!G$3,'Grading Scale'!B$5,'Grading Scale'!B$3))))))","v":3},{"$f":"Scores!B70","v":0},{"$f":"IF(S79>='Grading Scale'!B$13,IF(S79='Grading Scale'!B$3,'Grading Scale'!C$3,IF(S79='Grading Scale'!B$5,'Grading Scale'!C$5,IF(S79='Grading Scale'!B$7,'Grading Scale'!C$7,IF(S79='Grading Scale'!B$9,'Grading Scale'!C$9,IF(S79='Grading Scale'!B$11,'Grading Scale'!C$11,'Grading Scale'!C$13))))),IF(S79='Grading Scale'!E$3,'Grading Scale'!F$3,IF(S79='Grading Scale'!E$5,'Grading Scale'!F$5,IF(S79='Grading Scale'!E$7,'Grading Scale'!F$7,IF(S79='Grading Scale'!E$9,'Grading Scale'!F$9,IF(S79='Grading Scale'!E$11,'Grading Scale'!F$11,'Grading Scale'!F$13))))))","v":"B    "}," ",null,""]
[{"$f":"Scores!A71","v":0},{"$f":"Scores!B71","v":0},{"$f":"Scores!C71","v":0},{"$f":"Scores!D71","v":0},{"$f":"Scores!E71","v":0},{"$f":"Scores!F71","v":0},{"$f":"Scores!G71","v":0},{"$f":"Scores!H71","v":0},{"$f":"Scores!I71","v":0},{"$f":"Scores!J71","v":0},{"$f":"Scores!K71","v":0},{"$f":"Scores!L71","v":0},{"$f":"Scores!M71","v":0},{"$f":"Scores!N71","v":0},{"$f":"Scores!O71","v":0},-0.70710678118654746,2.9512994231491119,2.9512994231491119,{"$f":"IF(R80<'Grading Scale'!G$8,IF(R80<'Grading Scale'!G$13,'Grading Scale'!E$13,IF(R80<'Grading Scale'!G$12,'Grading Scale'!E$11,IF(R80<'Grading Scale'!G$11,'Grading Scale'!E$9,IF(R80<'Grading Scale'!G$10,'Grading Scale'!E$7,IF(R80<'Grading Scale'!G$9,'Grading Scale'!E$5,'Grading Scale'!E$3))))),IF(R80<'Grading Scale'!G$7,'Grading Scale'!B$13,IF(R80<'Grading Scale'!G$6,'Grading Scale'!B$11,IF(R80<'Grading Scale'!G$5,'Grading Scale'!B$9,IF(R80<'Grading Scale'!G$4,'Grading Scale'!B$7,IF(R80<'Grading Scale'!G$3,'Grading Scale'!B$5,'Grading Scale'!B$3))))))","v":3},{"$f":"Scores!B71","v":0},{"$f":"IF(S80>='Grading Scale'!B$13,IF(S80='Grading Scale'!B$3,'Grading Scale'!C$3,IF(S80='Grading Scale'!B$5,'Grading Scale'!C$5,IF(S80='Grading Scale'!B$7,'Grading Scale'!C$7,IF(S80='Grading Scale'!B$9,'Grading Scale'!C$9,IF(S80='Grading Scale'!B$11,'Grading Scale'!C$11,'Grading Scale'!C$13))))),IF(S80='Grading Scale'!E$3,'Grading Scale'!F$3,IF(S80='Grading Scale'!E$5,'Grading Scale'!F$5,IF(S80='Grading Scale'!E$7,'Grading Scale'!F$7,IF(S80='Grading Scale'!E$9,'Grading Scale'!F$9,IF(S80='Grading Scale'!E$11,'Grading Scale'!F$11,'Grading Scale'!F$13))))))","v":"B    "}," ",null,""]
[{"$f":"Scores!A72","v":0},{"$f":"Scores!B72","v":0},{"$f":"Scores!C72","v":0},{"$f":"Scores!D72","v":0},{"$f":"Scores!E72","v":0},{"$f":"Scores!F72","v":0},{"$f":"Scores!G72","v":0},{"$f":"Scores!H72","v":0},{"$f":"Scores!I72","v":0},{"$f":"Scores!J72","v":0},{"$f":"Scores!K72","v":0},{"$f":"Scores!L72","v":0},{"$f":"Scores!M72","v":0},{"$f":"Scores!N72","v":0},{"$f":"Scores!O72","v":0},-0.70710678118654746,2.9512994231491119,2.9512994231491119,{"$f":"IF(R81<'Grading Scale'!G$8,IF(R81<'Grading Scale'!G$13,'Grading Scale'!E$13,IF(R81<'Grading Scale'!G$12,'Grading Scale'!E$11,IF(R81<'Grading Scale'!G$11,'Grading Scale'!E$9,IF(R81<'Grading Scale'!G$10,'Grading Scale'!E$7,IF(R81<'Grading Scale'!G$9,'Grading Scale'!E$5,'Grading Scale'!E$3))))),IF(R81<'Grading Scale'!G$7,'Grading Scale'!B$13,IF(R81<'Grading Scale'!G$6,'Grading Scale'!B$11,IF(R81<'Grading Scale'!G$5,'Grading Scale'!B$9,IF(R81<'Grading Scale'!G$4,'Grading Scale'!B$7,IF(R81<'Grading Scale'!G$3,'Grading Scale'!B$5,'Grading Scale'!B$3))))))","v":3},{"$f":"Scores!B72","v":0},{"$f":"IF(S81>='Grading Scale'!B$13,IF(S81='Grading Scale'!B$3,'Grading Scale'!C$3,IF(S81='Grading Scale'!B$5,'Grading Scale'!C$5,IF(S81='Grading Scale'!B$7,'Grading Scale'!C$7,IF(S81='Grading Scale'!B$9,'Grading Scale'!C$9,IF(S81='Grading Scale'!B$11,'Grading Scale'!C$11,'Grading Scale'!C$13))))),IF(S81='Grading Scale'!E$3,'Grading Scale'!F$3,IF(S81='Grading Scale'!E$5,'Grading Scale'!F$5,IF(S81='Grading Scale'!E$7,'Grading Scale'!F$7,IF(S81='Grading Scale'!E$9,'Grading Scale'!F$9,IF(S81='Grading Scale'!E$11,'Grading Scale'!F$11,'Grading Scale'!F$13))))))","v":"B    "}," ",null,""]
[{"$f":"Scores!A73","v":0},{"$f":"Scores!B73","v":0},{"$f":"Scores!C73","v":0},{"$f":"Scores!D73","v":0},{"$f":"Scores!E73","v":0},{"$f":"Scores!F73","v":0},{"$f":"Scores!G73","v":0},{"$f":"Scores!H73","v":0},{"$f":"Scores!I73","v":0},{"$f":"Scores!J73","v":0},{"$f":"Scores!K73","v":0},{"$f":"Scores!L73","v":0},{"$f":"Scores!M73","v":0},{"$f":"Scores!N73","v":0},{"$f":"Scores!O73","v":0},-0.70710678118654746,2.9512994231491119,2.9512994231491119,{"$f":"IF(R82<'Grading Scale'!G$8,IF(R82<'Grading Scale'!G$13,'Grading Scale'!E$13,IF(R82<'Grading Scale'!G$12,'Grading Scale'!E$11,IF(R82<'Grading Scale'!G$11,'Grading Scale'!E$9,IF(R82<'Grading Scale'!G$10,'Grading Scale'!E$7,IF(R82<'Grading Scale'!G$9,'Grading Scale'!E$5,'Grading Scale'!E$3))))),IF(R82<'Grading Scale'!G$7,'Grading Scale'!B$13,IF(R82<'Grading Scale'!G$6,'Grading Scale'!B$11,IF(R82<'Grading Scale'!G$5,'Grading Scale'!B$9,IF(R82<'Grading Scale'!G$4,'Grading Scale'!B$7,IF(R82<'Grading Scale'!G$3,'Grading Scale'!B$5,'Grading Scale'!B$3))))))","v":3},{"$f":"Scores!B73","v":0},{"$f":"IF(S82>='Grading Scale'!B$13,IF(S82='Grading Scale'!B$3,'Grading Scale'!C$3,IF(S82='Grading Scale'!B$5,'Grading Scale'!C$5,IF(S82='Grading Scale'!B$7,'Grading Scale'!C$7,IF(S82='Grading Scale'!B$9,'Grading Scale'!C$9,IF(S82='Grading Scale'!B$11,'Grading Scale'!C$11,'Grading Scale'!C$13))))),IF(S82='Grading Scale'!E$3,'Grading Scale'!F$3,IF(S82='Grading Scale'!E$5,'Grading Scale'!F$5,IF(S82='Grading Scale'!E$7,'Grading Scale'!F$7,IF(S82='Grading Scale'!E$9,'Grading Scale'!F$9,IF(S82='Grading Scale'!E$11,'Grading Scale'!F$11,'Grading Scale'!F$13))))))","v":"B    "}," ",null,""]
[{"$f":"Scores!A74","v":0},{"$f":"Scores!B74","v":0},{"$f":"Scores!C74","v":0},{"$f":"Scores!D74","v":0},{"$f":"Scores!E74","v":0},{"$f":"Scores!F74","v":0},{"$f":"Scores!G74","v":0},{"$f":"Scores!H74","v":0},{"$f":"Scores!I74","v":0},{"$f":"Scores!J74","v":0},{"$f":"Scores!K74","v":0},{"$f":"Scores!L74","v":0},{"$f":"Scores!M74","v":0},{"$f":"Scores!N74","v":0},{"$f":"Scores!O74","v":0},-0.70710678118654746,2.9512994231491119,2.9512994231491119,{"$f":"IF(R83<'Grading Scale'!G$8,IF(R83<'Grading Scale'!G$13,'Grading Scale'!E$13,IF(R83<'Grading Scale'!G$12,'Grading Scale'!E$11,IF(R83<'Grading Scale'!G$11,'Grading Scale'!E$9,IF(R83<'Grading Scale'!G$10,'Grading Scale'!E$7,IF(R83<'Grading Scale'!G$9,'Grading Scale'!E$5,'Grading Scale'!E$3))))),IF(R83<'Grading Scale'!G$7,'Grading Scale'!B$13,IF(R83<'Grading Scale'!G$6,'Grading Scale'!B$11,IF(R83<'Grading Scale'!G$5,'Grading Scale'!B$9,IF(R83<'Grading Scale'!G$4,'Grading Scale'!B$7,IF(R83<'Grading Scale'!G$3,'Grading Scale'!B$5,'Grading Scale'!B$3))))))","v":3},{"$f":"Scores!B74","v":0},{"$f":"IF(S83>='Grading Scale'!B$13,IF(S83='Grading Scale'!B$3,'Grading Scale'!C$3,IF(S83='Grading Scale'!B$5,'Grading Scale'!C$5,IF(S83='Grading Scale'!B$7,'Grading Scale'!C$7,IF(S83='Grading Scale'!B$9,'Grading Scale'!C$9,IF(S83='Grading Scale'!B$11,'Grading Scale'!C$11,'Grading Scale'!C$13))))),IF(S83='Grading Scale'!E$3,'Grading Scale'!F$3,IF(S83='Grading Scale'!E$5,'Grading Scale'!F$5,IF(S83='Grading Scale'!E$7,'Grading Scale'!F$7,IF(S83='Grading Scale'!E$9,'Grading Scale'!F$9,IF(S83='Grading Scale'!E$11,'Grading Scale'!F$11,'Grading Scale'!F$13))))))","v":"B    "}," ",null,""]
[{"$f":"Scores!A75","v":0},{"$f":"Scores!B75","v":0},{"$f":"Scores!C75","v":0},{"$f":"Scores!D75","v":0},{"$f":"Scores!E75","v":0},{"$f":"Scores!F75","v":0},{"$f":"Scores!G75","v":0},{"$f":"Scores!H75","v":0},{"$f":"Scores!I75","v":0},{"$f":"Scores!J75","v":0},{"$f":"Scores!K75","v":0},{"$f":"Scores!L75","v":0},{"$f":"Scores!M75","v":0},{"$f":"Scores!N75","v":0},{"$f":"Scores!O75","v":0},-0.70710678118654746,2.9512994231491119,2.9512994231491119,{"$f":"IF(R84<'Grading Scale'!G$8,IF(R84<'Grading Scale'!G$13,'Grading Scale'!E$13,IF(R84<'Grading Scale'!G$12,'Grading Scale'!E$11,IF(R84<'Grading Scale'!G$11,'Grading Scale'!E$9,IF(R84<'Grading Scale'!G$10,'Grading Scale'!E$7,IF(R84<'Grading Scale'!G$9,'Grading Scale'!E$5,'Grading Scale'!E$3))))),IF(R84<'Grading Scale'!G$7,'Grading Scale'!B$13,IF(R84<'Grading Scale'!G$6,'Grading Scale'!B$11,IF(R84<'Grading Scale'!G$5,'Grading Scale'!B$9,IF(R84<'Grading Scale'!G$4,'Grading Scale'!B$7,IF(R84<'Grading Scale'!G$3,'Grading Scale'!B$5,'Grading Scale'!B$3))))))","v":3},{"$f":"Scores!B75","v":0},{"$f":"IF(S84>='Grading Scale'!B$13,IF(S84='Grading Scale'!B$3,'Grading Scale'!C$3,IF(S84='Grading Scale'!B$5,'Grading Scale'!C$5,IF(S84='Grading Scale'!B$7,'Grading Scale'!C$7,IF(S84='Grading Scale'!B$9,'Grading Scale'!C$9,IF(S84='Grading Scale'!B$11,'Grading Scale'!C$11,'Grading Scale'!C$13))))),IF(S84='Grading Scale'!E$3,'Grading Scale'!F$3,IF(S84='Grading Scale'!E$5,'Grading Scale'!F$5,IF(S84='Grading Scale'!E$7,'Grading Scale'!F$7,IF(S84='Grading Scale'!E$9,'Grading Scale'!F$9,IF(S84='Grading Scale'!E$11,'Grading Scale'!F$11,'Grading Scale'!F$13))))))","v":"B    "}," ",null,""]
[{"$f":"Scores!A76","v":0},{"$f":"Scores!B76","v":0},{"$f":"Scores!C76","v":0},{"$f":"Scores!D76","v":0},{"$f":"Scores!E76","v":0},{"$f":"Scores!F76","v":0},{"$f":"Scores!G76","v":0},{"$f":"Scores!H76","v":0},{"$f":"Scores!I76","v":0},{"$f":"Scores!J76","v":0},{"$f":"Scores!K76","v":0},{"$f":"Scores!L76","v":0},{"$f":"Scores!M76","v":0},{"$f":"Scores!N76","v":0},{"$f":"Scores!O76","v":0},-0.70710678118654746,2.9512994231491119,2.9512994231491119,{"$f":"IF(R85<'Grading Scale'!G$8,IF(R85<'Grading Scale'!G$13,'Grading Scale'!E$13,IF(R85<'Grading Scale'!G$12,'Grading Scale'!E$11,IF(R85<'Grading Scale'!G$11,'Grading Scale'!E$9,IF(R85<'Grading Scale'!G$10,'Grading Scale'!E$7,IF(R85<'Grading Scale'!G$9,'Grading Scale'!E$5,'Grading Scale'!E$3))))),IF(R85<'Grading Scale'!G$7,'Grading Scale'!B$13,IF(R85<'Grading Scale'!G$6,'Grading Scale'!B$11,IF(R85<'Grading Scale'!G$5,'Grading Scale'!B$9,IF(R85<'Grading Scale'!G$4,'Grading Scale'!B$7,IF(R85<'Grading Scale'!G$3,'Grading Scale'!B$5,'Grading Scale'!B$3))))))","v":3},{"$f":"Scores!B76","v":0},{"$f":"IF(S85>='Grading Scale'!B$13,IF(S85='Grading Scale'!B$3,'Grading Scale'!C$3,IF(S85='Grading Scale'!B$5,'Grading Scale'!C$5,IF(S85='Grading Scale'!B$7,'Grading Scale'!C$7,IF(S85='Grading Scale'!B$9,'Grading Scale'!C$9,IF(S85='Grading Scale'!B$11,'Grading Scale'!C$11,'Grading Scale'!C$13))))),IF(S85='Grading Scale'!E$3,'Grading Scale'!F$3,IF(S85='Grading Scale'!E$5,'Grading Scale'!F$5,IF(S85='Grading Scale'!E$7,'Grading Scale'!F$7,IF(S85='Grading Scale'!E$9,'Grading Scale'!F$9,IF(S85='Grading Scale'!E$11,'Grading Scale'!F$11,'Grading Scale'!F$13))))))","v":"B    "}," ",null,""]
[{"$f":"Scores!A77","v":0},{"$f":"Scores!B77","v":0},{"$f":"Scores!C77","v":0},{"$f":"Scores!D77","v":0},{"$f":"Scores!E77","v":0},{"$f":"Scores!F77","v":0},{"$f":"Scores!G77","v":0},{"$f":"Scores!H77","v":0},{"$f":"Scores!I77","v":0},{"$f":"Scores!J77","v":0},{"$f":"Scores!K77","v":0},{"$f":"Scores!L77","v":0},{"$f":"Scores!M77","v":0},{"$f":"Scores!N77","v":0},{"$f":"Scores!O77","v":0},-0.70710678118654746,2.9512994231491119,2.9512994231491119,{"$f":"IF(R86<'Grading Scale'!G$8,IF(R86<'Grading Scale'!G$13,'Grading Scale'!E$13,IF(R86<'Grading Scale'!G$12,'Grading Scale'!E$11,IF(R86<'Grading Scale'!G$11,'Grading Scale'!E$9,IF(R86<'Grading Scale'!G$10,'Grading Scale'!E$7,IF(R86<'Grading Scale'!G$9,'Grading Scale'!E$5,'Grading Scale'!E$3))))),IF(R86<'Grading Scale'!G$7,'Grading Scale'!B$13,IF(R86<'Grading Scale'!G$6,'Grading Scale'!B$11,IF(R86<'Grading Scale'!G$5,'Grading Scale'!B$9,IF(R86<'Grading Scale'!G$4,'Grading Scale'!B$7,IF(R86<'Grading Scale'!G$3,'Grading Scale'!B$5,'Grading Scale'!B$3))))))","v":3},{"$f":"Scores!B77","v":0},{"$f":"IF(S86>='Grading Scale'!B$13,IF(S86='Grading Scale'!B$3,'Grading Scale'!C$3,IF(S86='Grading Scale'!B$5,'Grading Scale'!C$5,IF(S86='Grading Scale'!B$7,'Grading Scale'!C$7,IF(S86='Grading Scale'!B$9,'Grading Scale'!C$9,IF(S86='Grading Scale'!B$11,'Grading Scale'!C$11,'Grading Scale'!C$13))))),IF(S86='Grading Scale'!E$3,'Grading Scale'!F$3,IF(S86='Grading Scale'!E$5,'Grading Scale'!F$5,IF(S86='Grading Scale'!E$7,'Grading Scale'!F$7,IF(S86='Grading Scale'!E$9,'Grading Scale'!F$9,IF(S86='Grading Scale'!E$11,'Grading Scale'!F$11,'Grading Scale'!F$13))))))","v":"B    "}," ",null,""]
[{"$f":"Scores!A78","v":0},{"$f":"Scores!B78","v":0},{"$f":"Scores!C78","v":0},{"$f":"Scores!D78","v":0},{"$f":"Scores!E78","v":0},{"$f":"Scores!F78","v":0},{"$f":"Scores!G78","v":0},{"$f":"Scores!H78","v":0},{"$f":"Scores!I78","v":0},{"$f":"Scores!J78","v":0},{"$f":"Scores!K78","v":0},{"$f":"Scores!L78","v":0},{"$f":"Scores!M78","v":0},{"$f":"Scores!N78","v":0},{"$f":"Scores!O78","v":0},{"$f":"(C87-$C$17)*$C$19+(D87-$D$17)*$D$19+(E87-$E$17)*$E$19+(F87-$F$17)*$F$19+(G87-$G$17)*$G$19+(H87-$H$17)*$H$19+(I87-$I$17)*$I$19+(J87-$J$17)*$J$19+(K87-$K$17)*$K$19+(L87-$L$17)*$L$19","v":-0.70710678118654746},{"$f":"(((P87-$P$19)/$P$16)*$S$2)+$S$1","v":2.9512994231491119},{"$f":"Q87+(N87*N$21)+(O87*O$21)","v":2.9512994231491119},{"$f":"IF(R87<'Grading Scale'!G$8,IF(R87<'Grading Scale'!G$13,'Grading Scale'!E$13,IF(R87<'Grading Scale'!G$12,'Grading Scale'!E$11,IF(R87<'Grading Scale'!G$11,'Grading Scale'!E$9,IF(R87<'Grading Scale'!G$10,'Grading Scale'!E$7,IF(R87<'Grading Scale'!G$9,'Grading Scale'!E$5,'Grading Scale'!E$3))))),IF(R87<'Grading Scale'!G$7,'Grading Scale'!B$13,IF(R87<'Grading Scale'!G$6,'Grading Scale'!B$11,IF(R87<'Grading Scale'!G$5,'Grading Scale'!B$9,IF(R87<'Grading Scale'!G$4,'Grading Scale'!B$7,IF(R87<'Grading Scale'!G$3,'Grading Scale'!B$5,'Grading Scale'!B$3))))))","v":3},{"$f":"Scores!B78","v":0},{"$f":"IF(S87>='Grading Scale'!B$13,IF(S87='Grading Scale'!B$3,'Grading Scale'!C$3,IF(S87='Grading Scale'!B$5,'Grading Scale'!C$5,IF(S87='Grading Scale'!B$7,'Grading Scale'!C$7,IF(S87='Grading Scale'!B$9,'Grading Scale'!C$9,IF(S87='Grading Scale'!B$11,'Grading Scale'!C$11,'Grading Scale'!C$13))))),IF(S87='Grading Scale'!E$3,'Grading Scale'!F$3,IF(S87='Grading Scale'!E$5,'Grading Scale'!F$5,IF(S87='Grading Scale'!E$7,'Grading Scale'!F$7,IF(S87='Grading Scale'!E$9,'Grading Scale'!F$9,IF(S87='Grading Scale'!E$11,'Grading Scale'!F$11,'Grading Scale'!F$13))))))","v":"B    "},{"$f":"IF(P87=$P$17,\"BEST\",\" \")","v":" "},null,{"$f":"IF(W87=0,\"\",IF(W87=S87,\"\",IF(W87>S87,\"dropped\",\"increased\")))","v":""}]
[{"$f":"Scores!A79","v":0},{"$f":"Scores!B79","v":0},{"$f":"Scores!C79","v":0},{"$f":"Scores!D79","v":0},{"$f":"Scores!E79","v":0},{"$f":"Scores!F79","v":0},{"$f":"Scores!G79","v":0},{"$f":"Scores!H79","v":0},{"$f":"Scores!I79","v":0},{"$f":"Scores!J79","v":0},{"$f":"Scores!K79","v":0},{"$f":"Scores!L79","v":0},{"$f":"Scores!M79","v":0},{"$f":"Scores!N79","v":0},{"$f":"Scores!O79","v":0},-0.70710678118654746,2.9512994231491119,2.9512994231491119,{"$f":"IF(R88<'Grading Scale'!G$8,IF(R88<'Grading Scale'!G$13,'Grading Scale'!E$13,IF(R88<'Grading Scale'!G$12,'Grading Scale'!E$11,IF(R88<'Grading Scale'!G$11,'Grading Scale'!E$9,IF(R88<'Grading Scale'!G$10,'Grading Scale'!E$7,IF(R88<'Grading Scale'!G$9,'Grading Scale'!E$5,'Grading Scale'!E$3))))),IF(R88<'Grading Scale'!G$7,'Grading Scale'!B$13,IF(R88<'Grading Scale'!G$6,'Grading Scale'!B$11,IF(R88<'Grading Scale'!G$5,'Grading Scale'!B$9,IF(R88<'Grading Scale'!G$4,'Grading Scale'!B$7,IF(R88<'Grading Scale'!G$3,'Grading Scale'!B$5,'Grading Scale'!B$3))))))","v":3},{"$f":"Scores!B79","v":0},{"$f":"IF(S88>='Grading Scale'!B$13,IF(S88='Grading Scale'!B$3,'Grading Scale'!C$3,IF(S88='Grading Scale'!B$5,'Grading Scale'!C$5,IF(S88='Grading Scale'!B$7,'Grading Scale'!C$7,IF(S88='Grading Scale'!B$9,'Grading Scale'!C$9,IF(S88='Grading Scale'!B$11,'Grading Scale'!C$11,'Grading Scale'!C$13))))),IF(S88='Grading Scale'!E$3,'Grading Scale'!F$3,IF(S88='Grading Scale'!E$5,'Grading Scale'!F$5,IF(S88='Grading Scale'!E$7,'Grading Scale'!F$7,IF(S88='Grading Scale'!E$9,'Grading Scale'!F$9,IF(S88='Grading Scale'!E$11,'Grading Scale'!F$11,'Grading Scale'!F$13))))))","v":"B    "}," ",null,""]
[{"$f":"Scores!A80","v":0},{"$f":"Scores!B80","v":0},{"$f":"Scores!C80","v":0},{"$f":"Scores!D80","v":0},{"$f":"Scores!E80","v":0},{"$f":"Scores!F80","v":0},{"$f":"Scores!G80","v":0},{"$f":"Scores!H80","v":0},{"$f":"Scores!I80","v":0},{"$f":"Scores!J80","v":0},{"$f":"Scores!K80","v":0},{"$f":"Scores!L80","v":0},{"$f":"Scores!M80","v":0},{"$f":"Scores!N80","v":0},{"$f":"Scores!O80","v":0},-0.70710678118654746,2.9512994231491119,2.9512994231491119,{"$f":"IF(R89<'Grading Scale'!G$8,IF(R89<'Grading Scale'!G$13,'Grading Scale'!E$13,IF(R89<'Grading Scale'!G$12,'Grading Scale'!E$11,IF(R89<'Grading Scale'!G$11,'Grading Scale'!E$9,IF(R89<'Grading Scale'!G$10,'Grading Scale'!E$7,IF(R89<'Grading Scale'!G$9,'Grading Scale'!E$5,'Grading Scale'!E$3))))),IF(R89<'Grading Scale'!G$7,'Grading Scale'!B$13,IF(R89<'Grading Scale'!G$6,'Grading Scale'!B$11,IF(R89<'Grading Scale'!G$5,'Grading Scale'!B$9,IF(R89<'Grading Scale'!G$4,'Grading Scale'!B$7,IF(R89<'Grading Scale'!G$3,'Grading Scale'!B$5,'Grading Scale'!B$3))))))","v":3},{"$f":"Scores!B80","v":0},{"$f":"IF(S89>='Grading Scale'!B$13,IF(S89='Grading Scale'!B$3,'Grading Scale'!C$3,IF(S89='Grading Scale'!B$5,'Grading Scale'!C$5,IF(S89='Grading Scale'!B$7,'Grading Scale'!C$7,IF(S89='Grading Scale'!B$9,'Grading Scale'!C$9,IF(S89='Grading Scale'!B$11,'Grading Scale'!C$11,'Grading Scale'!C$13))))),IF(S89='Grading Scale'!E$3,'Grading Scale'!F$3,IF(S89='Grading Scale'!E$5,'Grading Scale'!F$5,IF(S89='Grading Scale'!E$7,'Grading Scale'!F$7,IF(S89='Grading Scale'!E$9,'Grading Scale'!F$9,IF(S89='Grading Scale'!E$11,'Grading Scale'!F$11,'Grading Scale'!F$13))))))","v":"B    "}," ",null,""]
[{"$f":"Scores!A81","v":0},{"$f":"Scores!B81","v":0},{"$f":"Scores!C81","v":0},{"$f":"Scores!D81","v":0},{"$f":"Scores!E81","v":0},{"$f":"Scores!F81","v":0},{"$f":"Scores!G81","v":0},{"$f":"Scores!H81","v":0},{"$f":"Scores!I81","v":0},{"$f":"Scores!J81","v":0},{"$f":"Scores!K81","v":0},{"$f":"Scores!L81","v":0},{"$f":"Scores!M81","v":0},{"$f":"Scores!N81","v":0},{"$f":"Scores!O81","v":0},-0.70710678118654746,2.9512994231491119,2.9512994231491119,{"$f":"IF(R90<'Grading Scale'!G$8,IF(R90<'Grading Scale'!G$13,'Grading Scale'!E$13,IF(R90<'Grading Scale'!G$12,'Grading Scale'!E$11,IF(R90<'Grading Scale'!G$11,'Grading Scale'!E$9,IF(R90<'Grading Scale'!G$10,'Grading Scale'!E$7,IF(R90<'Grading Scale'!G$9,'Grading Scale'!E$5,'Grading Scale'!E$3))))),IF(R90<'Grading Scale'!G$7,'Grading Scale'!B$13,IF(R90<'Grading Scale'!G$6,'Grading Scale'!B$11,IF(R90<'Grading Scale'!G$5,'Grading Scale'!B$9,IF(R90<'Grading Scale'!G$4,'Grading Scale'!B$7,IF(R90<'Grading Scale'!G$3,'Grading Scale'!B$5,'Grading Scale'!B$3))))))","v":3},{"$f":"Scores!B81","v":0},{"$f":"IF(S90>='Grading Scale'!B$13,IF(S90='Grading Scale'!B$3,'Grading Scale'!C$3,IF(S90='Grading Scale'!B$5,'Grading Scale'!C$5,IF(S90='Grading Scale'!B$7,'Grading Scale'!C$7,IF(S90='Grading Scale'!B$9,'Grading Scale'!C$9,IF(S90='Grading Scale'!B$11,'Grading Scale'!C$11,'Grading Scale'!C$13))))),IF(S90='Grading Scale'!E$3,'Grading Scale'!F$3,IF(S90='Grading Scale'!E$5,'Grading Scale'!F$5,IF(S90='Grading Scale'!E$7,'Grading Scale'!F$7,IF(S90='Grading Scale'!E$9,'Grading Scale'!F$9,IF(S90='Grading Scale'!E$11,'Grading Scale'!F$11,'Grading Scale'!F$13))))))","v":"B    "}," ",null,""]
[{"$f":"Scores!A82","v":0},{"$f":"Scores!B82","v":0},{"$f":"Scores!C82","v":0},{"$f":"Scores!D82","v":0},{"$f":"Scores!E82","v":0},{"$f":"Scores!F82","v":0},{"$f":"Scores!G82","v":0},{"$f":"Scores!H82","v":0},{"$f":"Scores!I82","v":0},{"$f":"Scores!J82","v":0},{"$f":"Scores!K82","v":0},{"$f":"Scores!L82","v":0},{"$f":"Scores!M82","v":0},{"$f":"Scores!N82","v":0},{"$f":"Scores!O82","v":0},-0.70710678118654746,2.9512994231491119,2.9512994231491119,{"$f":"IF(R91<'Grading Scale'!G$8,IF(R91<'Grading Scale'!G$13,'Grading Scale'!E$13,IF(R91<'Grading Scale'!G$12,'Grading Scale'!E$11,IF(R91<'Grading Scale'!G$11,'Grading Scale'!E$9,IF(R91<'Grading Scale'!G$10,'Grading Scale'!E$7,IF(R91<'Grading Scale'!G$9,'Grading Scale'!E$5,'Grading Scale'!E$3))))),IF(R91<'Grading Scale'!G$7,'Grading Scale'!B$13,IF(R91<'Grading Scale'!G$6,'Grading Scale'!B$11,IF(R91<'Grading Scale'!G$5,'Grading Scale'!B$9,IF(R91<'Grading Scale'!G$4,'Grading Scale'!B$7,IF(R91<'Grading Scale'!G$3,'Grading Scale'!B$5,'Grading Scale'!B$3))))))","v":3},{"$f":"Scores!B82","v":0},{"$f":"IF(S91>='Grading Scale'!B$13,IF(S91='Grading Scale'!B$3,'Grading Scale'!C$3,IF(S91='Grading Scale'!B$5,'Grading Scale'!C$5,IF(S91='Grading Scale'!B$7,'Grading Scale'!C$7,IF(S91='Grading Scale'!B$9,'Grading Scale'!C$9,IF(S91='Grading Scale'!B$11,'Grading Scale'!C$11,'Grading Scale'!C$13))))),IF(S91='Grading Scale'!E$3,'Grading Scale'!F$3,IF(S91='Grading Scale'!E$5,'Grading Scale'!F$5,IF(S91='Grading Scale'!E$7,'Grading Scale'!F$7,IF(S91='Grading Scale'!E$9,'Grading Scale'!F$9,IF(S91='Grading Scale'!E$11,'Grading Scale'!F$11,'Grading Scale'!F$13))))))","v":"B    "}," ",null,""]
[{"$f":"Scores!A83","v":0},{"$f":"Scores!B83","v":0},{"$f":"Scores!C83","v":0},{"$f":"Scores!D83","v":0},{"$f":"Scores!E83","v":0},{"$f":"Scores!F83","v":0},{"$f":"Scores!G83","v":0},{"$f":"Scores!H83","v":0},{"$f":"Scores!I83","v":0},{"$f":"Scores!J83","v":0},{"$f":"Scores!K83","v":0},{"$f":"Scores!L83","v":0},{"$f":"Scores!M83","v":0},{"$f":"Scores!N83","v":0},{"$f":"Scores!O83","v":0},-0.70710678118654746,2.9512994231491119,2.9512994231491119,{"$f":"IF(R92<'Grading Scale'!G$8,IF(R92<'Grading Scale'!G$13,'Grading Scale'!E$13,IF(R92<'Grading Scale'!G$12,'Grading Scale'!E$11,IF(R92<'Grading Scale'!G$11,'Grading Scale'!E$9,IF(R92<'Grading Scale'!G$10,'Grading Scale'!E$7,IF(R92<'Grading Scale'!G$9,'Grading Scale'!E$5,'Grading Scale'!E$3))))),IF(R92<'Grading Scale'!G$7,'Grading Scale'!B$13,IF(R92<'Grading Scale'!G$6,'Grading Scale'!B$11,IF(R92<'Grading Scale'!G$5,'Grading Scale'!B$9,IF(R92<'Grading Scale'!G$4,'Grading Scale'!B$7,IF(R92<'Grading Scale'!G$3,'Grading Scale'!B$5,'Grading Scale'!B$3))))))","v":3},{"$f":"Scores!B83","v":0},{"$f":"IF(S92>='Grading Scale'!B$13,IF(S92='Grading Scale'!B$3,'Grading Scale'!C$3,IF(S92='Grading Scale'!B$5,'Grading Scale'!C$5,IF(S92='Grading Scale'!B$7,'Grading Scale'!C$7,IF(S92='Grading Scale'!B$9,'Grading Scale'!C$9,IF(S92='Grading Scale'!B$11,'Grading Scale'!C$11,'Grading Scale'!C$13))))),IF(S92='Grading Scale'!E$3,'Grading Scale'!F$3,IF(S92='Grading Scale'!E$5,'Grading Scale'!F$5,IF(S92='Grading Scale'!E$7,'Grading Scale'!F$7,IF(S92='Grading Scale'!E$9,'Grading Scale'!F$9,IF(S92='Grading Scale'!E$11,'Grading Scale'!F$11,'Grading Scale'!F$13))))))","v":"B    "}," ",null,""]
[{"$f":"Scores!A84","v":0},{"$f":"Scores!B84","v":0},{"$f":"Scores!C84","v":0},{"$f":"Scores!D84","v":0},{"$f":"Scores!E84","v":0},{"$f":"Scores!F84","v":0},{"$f":"Scores!G84","v":0},{"$f":"Scores!H84","v":0},{"$f":"Scores!I84","v":0},{"$f":"Scores!J84","v":0},{"$f":"Scores!K84","v":0},{"$f":"Scores!L84","v":0},{"$f":"Scores!M84","v":0},{"$f":"Scores!N84","v":0},{"$f":"Scores!O84","v":0},-0.70710678118654746,2.9512994231491119,2.9512994231491119,{"$f":"IF(R93<'Grading Scale'!G$8,IF(R93<'Grading Scale'!G$13,'Grading Scale'!E$13,IF(R93<'Grading Scale'!G$12,'Grading Scale'!E$11,IF(R93<'Grading Scale'!G$11,'Grading Scale'!E$9,IF(R93<'Grading Scale'!G$10,'Grading Scale'!E$7,IF(R93<'Grading Scale'!G$9,'Grading Scale'!E$5,'Grading Scale'!E$3))))),IF(R93<'Grading Scale'!G$7,'Grading Scale'!B$13,IF(R93<'Grading Scale'!G$6,'Grading Scale'!B$11,IF(R93<'Grading Scale'!G$5,'Grading Scale'!B$9,IF(R93<'Grading Scale'!G$4,'Grading Scale'!B$7,IF(R93<'Grading Scale'!G$3,'Grading Scale'!B$5,'Grading Scale'!B$3))))))","v":3},{"$f":"Scores!B84","v":0},{"$f":"IF(S93>='Grading Scale'!B$13,IF(S93='Grading Scale'!B$3,'Grading Scale'!C$3,IF(S93='Grading Scale'!B$5,'Grading Scale'!C$5,IF(S93='Grading Scale'!B$7,'Grading Scale'!C$7,IF(S93='Grading Scale'!B$9,'Grading Scale'!C$9,IF(S93='Grading Scale'!B$11,'Grading Scale'!C$11,'Grading Scale'!C$13))))),IF(S93='Grading Scale'!E$3,'Grading Scale'!F$3,IF(S93='Grading Scale'!E$5,'Grading Scale'!F$5,IF(S93='Grading Scale'!E$7,'Grading Scale'!F$7,IF(S93='Grading Scale'!E$9,'Grading Scale'!F$9,IF(S93='Grading Scale'!E$11,'Grading Scale'!F$11,'Grading Scale'!F$13))))))","v":"B    "}," ",null,""]
[{"$f":"Scores!A85","v":0},{"$f":"Scores!B85","v":0},{"$f":"Scores!C85","v":0},{"$f":"Scores!D85","v":0},{"$f":"Scores!E85","v":0},{"$f":"Scores!F85","v":0},{"$f":"Scores!G85","v":0},{"$f":"Scores!H85","v":0},{"$f":"Scores!I85","v":0},{"$f":"Scores!J85","v":0},{"$f":"Scores!K85","v":0},{"$f":"Scores!L85","v":0},{"$f":"Scores!M85","v":0},{"$f":"Scores!N85","v":0},{"$f":"Scores!O85","v":0},-0.70710678118654746,2.9512994231491119,2.9512994231491119,{"$f":"IF(R94<'Grading Scale'!G$8,IF(R94<'Grading Scale'!G$13,'Grading Scale'!E$13,IF(R94<'Grading Scale'!G$12,'Grading Scale'!E$11,IF(R94<'Grading Scale'!G$11,'Grading Scale'!E$9,IF(R94<'Grading Scale'!G$10,'Grading Scale'!E$7,IF(R94<'Grading Scale'!G$9,'Grading Scale'!E$5,'Grading Scale'!E$3))))),IF(R94<'Grading Scale'!G$7,'Grading Scale'!B$13,IF(R94<'Grading Scale'!G$6,'Grading Scale'!B$11,IF(R94<'Grading Scale'!G$5,'Grading Scale'!B$9,IF(R94<'Grading Scale'!G$4,'Grading Scale'!B$7,IF(R94<'Grading Scale'!G$3,'Grading Scale'!B$5,'Grading Scale'!B$3))))))","v":3},{"$f":"Scores!B85","v":0},{"$f":"IF(S94>='Grading Scale'!B$13,IF(S94='Grading Scale'!B$3,'Grading Scale'!C$3,IF(S94='Grading Scale'!B$5,'Grading Scale'!C$5,IF(S94='Grading Scale'!B$7,'Grading Scale'!C$7,IF(S94='Grading Scale'!B$9,'Grading Scale'!C$9,IF(S94='Grading Scale'!B$11,'Grading Scale'!C$11,'Grading Scale'!C$13))))),IF(S94='Grading Scale'!E$3,'Grading Scale'!F$3,IF(S94='Grading Scale'!E$5,'Grading Scale'!F$5,IF(S94='Grading Scale'!E$7,'Grading Scale'!F$7,IF(S94='Grading Scale'!E$9,'Grading Scale'!F$9,IF(S94='Grading Scale'!E$11,'Grading Scale'!F$11,'Grading Scale'!F$13))))))","v":"B    "}," ",null,""]
[{"$f":"Scores!A86","v":0},{"$f":"Scores!B86","v":0},{"$f":"Scores!C86","v":0},{"$f":"Scores!D86","v":0},{"$f":"Scores!E86","v":0},{"$f":"Scores!F86","v":0},{"$f":"Scores!G86","v":0},{"$f":"Scores!H86","v":0},{"$f":"Scores!I86","v":0},{"$f":"Scores!J86","v":0},{"$f":"Scores!K86","v":0},{"$f":"Scores!L86","v":0},{"$f":"Scores!M86","v":0},{"$f":"Scores!N86","v":0},{"$f":"Scores!O86","v":0},-0.70710678118654746,2.9512994231491119,2.9512994231491119,{"$f":"IF(R95<'Grading Scale'!G$8,IF(R95<'Grading Scale'!G$13,'Grading Scale'!E$13,IF(R95<'Grading Scale'!G$12,'Grading Scale'!E$11,IF(R95<'Grading Scale'!G$11,'Grading Scale'!E$9,IF(R95<'Grading Scale'!G$10,'Grading Scale'!E$7,IF(R95<'Grading Scale'!G$9,'Grading Scale'!E$5,'Grading Scale'!E$3))))),IF(R95<'Grading Scale'!G$7,'Grading Scale'!B$13,IF(R95<'Grading Scale'!G$6,'Grading Scale'!B$11,IF(R95<'Grading Scale'!G$5,'Grading Scale'!B$9,IF(R95<'Grading Scale'!G$4,'Grading Scale'!B$7,IF(R95<'Grading Scale'!G$3,'Grading Scale'!B$5,'Grading Scale'!B$3))))))","v":3},{"$f":"Scores!B86","v":0},{"$f":"IF(S95>='Grading Scale'!B$13,IF(S95='Grading Scale'!B$3,'Grading Scale'!C$3,IF(S95='Grading Scale'!B$5,'Grading Scale'!C$5,IF(S95='Grading Scale'!B$7,'Grading Scale'!C$7,IF(S95='Grading Scale'!B$9,'Grading Scale'!C$9,IF(S95='Grading Scale'!B$11,'Grading Scale'!C$11,'Grading Scale'!C$13))))),IF(S95='Grading Scale'!E$3,'Grading Scale'!F$3,IF(S95='Grading Scale'!E$5,'Grading Scale'!F$5,IF(S95='Grading Scale'!E$7,'Grading Scale'!F$7,IF(S95='Grading Scale'!E$9,'Grading Scale'!F$9,IF(S95='Grading Scale'!E$11,'Grading Scale'!F$11,'Grading Scale'!F$13))))))","v":"B    "}," ",null,""]
[{"$f":"Scores!A87","v":0},{"$f":"Scores!B87","v":0},{"$f":"Scores!C87","v":0},{"$f":"Scores!D87","v":0},{"$f":"Scores!E87","v":0},{"$f":"Scores!F87","v":0},{"$f":"Scores!G87","v":0},{"$f":"Scores!H87","v":0},{"$f":"Scores!I87","v":0},{"$f":"Scores!J87","v":0},{"$f":"Scores!K87","v":0},{"$f":"Scores!L87","v":0},{"$f":"Scores!M87","v":0},{"$f":"Scores!N87","v":0},{"$f":"Scores!O87","v":0},-0.70710678118654746,2.9512994231491119,2.9512994231491119,{"$f":"IF(R96<'Grading Scale'!G$8,IF(R96<'Grading Scale'!G$13,'Grading Scale'!E$13,IF(R96<'Grading Scale'!G$12,'Grading Scale'!E$11,IF(R96<'Grading Scale'!G$11,'Grading Scale'!E$9,IF(R96<'Grading Scale'!G$10,'Grading Scale'!E$7,IF(R96<'Grading Scale'!G$9,'Grading Scale'!E$5,'Grading Scale'!E$3))))),IF(R96<'Grading Scale'!G$7,'Grading Scale'!B$13,IF(R96<'Grading Scale'!G$6,'Grading Scale'!B$11,IF(R96<'Grading Scale'!G$5,'Grading Scale'!B$9,IF(R96<'Grading Scale'!G$4,'Grading Scale'!B$7,IF(R96<'Grading Scale'!G$3,'Grading Scale'!B$5,'Grading Scale'!B$3))))))","v":3},{"$f":"Scores!B87","v":0},{"$f":"IF(S96>='Grading Scale'!B$13,IF(S96='Grading Scale'!B$3,'Grading Scale'!C$3,IF(S96='Grading Scale'!B$5,'Grading Scale'!C$5,IF(S96='Grading Scale'!B$7,'Grading Scale'!C$7,IF(S96='Grading Scale'!B$9,'Grading Scale'!C$9,IF(S96='Grading Scale'!B$11,'Grading Scale'!C$11,'Grading Scale'!C$13))))),IF(S96='Grading Scale'!E$3,'Grading Scale'!F$3,IF(S96='Grading Scale'!E$5,'Grading Scale'!F$5,IF(S96='Grading Scale'!E$7,'Grading Scale'!F$7,IF(S96='Grading Scale'!E$9,'Grading Scale'!F$9,IF(S96='Grading Scale'!E$11,'Grading Scale'!F$11,'Grading Scale'!F$13))))))","v":"B    "}," ",null,""]
[{"$f":"Scores!A88","v":0},{"$f":"Scores!B88","v":0},{"$f":"Scores!C88","v":0},{"$f":"Scores!D88","v":0},{"$f":"Scores!E88","v":0},{"$f":"Scores!F88","v":0},{"$f":"Scores!G88","v":0},{"$f":"Scores!H88","v":0},{"$f":"Scores!I88","v":0},{"$f":"Scores!J88","v":0},{"$f":"Scores!K88","v":0},{"$f":"Scores!L88","v":0},{"$f":"Scores!M88","v":0},{"$f":"Scores!N88","v":0},{"$f":"Scores!O88","v":0},-0.70710678118654746,2.9512994231491119,2.9512994231491119,{"$f":"IF(R97<'Grading Scale'!G$8,IF(R97<'Grading Scale'!G$13,'Grading Scale'!E$13,IF(R97<'Grading Scale'!G$12,'Grading Scale'!E$11,IF(R97<'Grading Scale'!G$11,'Grading Scale'!E$9,IF(R97<'Grading Scale'!G$10,'Grading Scale'!E$7,IF(R97<'Grading Scale'!G$9,'Grading Scale'!E$5,'Grading Scale'!E$3))))),IF(R97<'Grading Scale'!G$7,'Grading Scale'!B$13,IF(R97<'Grading Scale'!G$6,'Grading Scale'!B$11,IF(R97<'Grading Scale'!G$5,'Grading Scale'!B$9,IF(R97<'Grading Scale'!G$4,'Grading Scale'!B$7,IF(R97<'Grading Scale'!G$3,'Grading Scale'!B$5,'Grading Scale'!B$3))))))","v":3},{"$f":"Scores!B88","v":0},{"$f":"IF(S97>='Grading Scale'!B$13,IF(S97='Grading Scale'!B$3,'Grading Scale'!C$3,IF(S97='Grading Scale'!B$5,'Grading Scale'!C$5,IF(S97='Grading Scale'!B$7,'Grading Scale'!C$7,IF(S97='Grading Scale'!B$9,'Grading Scale'!C$9,IF(S97='Grading Scale'!B$11,'Grading Scale'!C$11,'Grading Scale'!C$13))))),IF(S97='Grading Scale'!E$3,'Grading Scale'!F$3,IF(S97='Grading Scale'!E$5,'Grading Scale'!F$5,IF(S97='Grading Scale'!E$7,'Grading Scale'!F$7,IF(S97='Grading Scale'!E$9,'Grading Scale'!F$9,IF(S97='Grading Scale'!E$11,'Grading Scale'!F$11,'Grading Scale'!F$13))))))","v":"B    "}," ",null,""]
[{"$f":"Scores!A89","v":0},{"$f":"Scores!B89","v":0},{"$f":"Scores!C89","v":0},{"$f":"Scores!D89","v":0},{"$f":"Scores!E89","v":0},{"$f":"Scores!F89","v":0},{"$f":"Scores!G89","v":0},{"$f":"Scores!H89","v":0},{"$f":"Scores!I89","v":0},{"$f":"Scores!J89","v":0},{"$f":"Scores!K89","v":0},{"$f":"Scores!L89","v":0},{"$f":"Scores!M89","v":0},{"$f":"Scores!N89","v":0},{"$f":"Scores!O89","v":0},-0.70710678118654746,2.9512994231491119,2.9512994231491119,{"$f":"IF(R98<'Grading Scale'!G$8,IF(R98<'Grading Scale'!G$13,'Grading Scale'!E$13,IF(R98<'Grading Scale'!G$12,'Grading Scale'!E$11,IF(R98<'Grading Scale'!G$11,'Grading Scale'!E$9,IF(R98<'Grading Scale'!G$10,'Grading Scale'!E$7,IF(R98<'Grading Scale'!G$9,'Grading Scale'!E$5,'Grading Scale'!E$3))))),IF(R98<'Grading Scale'!G$7,'Grading Scale'!B$13,IF(R98<'Grading Scale'!G$6,'Grading Scale'!B$11,IF(R98<'Grading Scale'!G$5,'Grading Scale'!B$9,IF(R98<'Grading Scale'!G$4,'Grading Scale'!B$7,IF(R98<'Grading Scale'!G$3,'Grading Scale'!B$5,'Grading Scale'!B$3))))))","v":3},{"$f":"Scores!B89","v":0},{"$f":"IF(S98>='Grading Scale'!B$13,IF(S98='Grading Scale'!B$3,'Grading Scale'!C$3,IF(S98='Grading Scale'!B$5,'Grading Scale'!C$5,IF(S98='Grading Scale'!B$7,'Grading Scale'!C$7,IF(S98='Grading Scale'!B$9,'Grading Scale'!C$9,IF(S98='Grading Scale'!B$11,'Grading Scale'!C$11,'Grading Scale'!C$13))))),IF(S98='Grading Scale'!E$3,'Grading Scale'!F$3,IF(S98='Grading Scale'!E$5,'Grading Scale'!F$5,IF(S98='Grading Scale'!E$7,'Grading Scale'!F$7,IF(S98='Grading Scale'!E$9,'Grading Scale'!F$9,IF(S98='Grading Scale'!E$11,'Grading Scale'!F$11,'Grading Scale'!F$13))))))","v":"B    "}," ",null,""]
[{"$f":"Scores!A90","v":0},{"$f":"Scores!B90","v":0},{"$f":"Scores!C90","v":0},{"$f":"Scores!D90","v":0},{"$f":"Scores!E90","v":0},{"$f":"Scores!F90","v":0},{"$f":"Scores!G90","v":0},{"$f":"Scores!H90","v":0},{"$f":"Scores!I90","v":0},{"$f":"Scores!J90","v":0},{"$f":"Scores!K90","v":0},{"$f":"Scores!L90","v":0},{"$f":"Scores!M90","v":0},{"$f":"Scores!N90","v":0},{"$f":"Scores!O90","v":0},-0.70710678118654746,2.9512994231491119,2.9512994231491119,{"$f":"IF(R99<'Grading Scale'!G$8,IF(R99<'Grading Scale'!G$13,'Grading Scale'!E$13,IF(R99<'Grading Scale'!G$12,'Grading Scale'!E$11,IF(R99<'Grading Scale'!G$11,'Grading Scale'!E$9,IF(R99<'Grading Scale'!G$10,'Grading Scale'!E$7,IF(R99<'Grading Scale'!G$9,'Grading Scale'!E$5,'Grading Scale'!E$3))))),IF(R99<'Grading Scale'!G$7,'Grading Scale'!B$13,IF(R99<'Grading Scale'!G$6,'Grading Scale'!B$11,IF(R99<'Grading Scale'!G$5,'Grading Scale'!B$9,IF(R99<'Grading Scale'!G$4,'Grading Scale'!B$7,IF(R99<'Grading Scale'!G$3,'Grading Scale'!B$5,'Grading Scale'!B$3))))))","v":3},{"$f":"Scores!B90","v":0},{"$f":"IF(S99>='Grading Scale'!B$13,IF(S99='Grading Scale'!B$3,'Grading Scale'!C$3,IF(S99='Grading Scale'!B$5,'Grading Scale'!C$5,IF(S99='Grading Scale'!B$7,'Grading Scale'!C$7,IF(S99='Grading Scale'!B$9,'Grading Scale'!C$9,IF(S99='Grading Scale'!B$11,'Grading Scale'!C$11,'Grading Scale'!C$13))))),IF(S99='Grading Scale'!E$3,'Grading Scale'!F$3,IF(S99='Grading Scale'!E$5,'Grading Scale'!F$5,IF(S99='Grading Scale'!E$7,'Grading Scale'!F$7,IF(S99='Grading Scale'!E$9,'Grading Scale'!F$9,IF(S99='Grading Scale'!E$11,'Grading Scale'!F$11,'Grading Scale'!F$13))))))","v":"B    "}," ",null,""]
[{"$f":"Scores!A91","v":0},{"$f":"Scores!B91","v":0},{"$f":"Scores!C91","v":0},{"$f":"Scores!D91","v":0},{"$f":"Scores!E91","v":0},{"$f":"Scores!F91","v":0},{"$f":"Scores!G91","v":0},{"$f":"Scores!H91","v":0},{"$f":"Scores!I91","v":0},{"$f":"Scores!J91","v":0},{"$f":"Scores!K91","v":0},{"$f":"Scores!L91","v":0},{"$f":"Scores!M91","v":0},{"$f":"Scores!N91","v":0},{"$f":"Scores!O91","v":0},-0.70710678118654746,2.9512994231491119,2.9512994231491119,{"$f":"IF(R100<'Grading Scale'!G$8,IF(R100<'Grading Scale'!G$13,'Grading Scale'!E$13,IF(R100<'Grading Scale'!G$12,'Grading Scale'!E$11,IF(R100<'Grading Scale'!G$11,'Grading Scale'!E$9,IF(R100<'Grading Scale'!G$10,'Grading Scale'!E$7,IF(R100<'Grading Scale'!G$9,'Grading Scale'!E$5,'Grading Scale'!E$3))))),IF(R100<'Grading Scale'!G$7,'Grading Scale'!B$13,IF(R100<'Grading Scale'!G$6,'Grading Scale'!B$11,IF(R100<'Grading Scale'!G$5,'Grading Scale'!B$9,IF(R100<'Grading Scale'!G$4,'Grading Scale'!B$7,IF(R100<'Grading Scale'!G$3,'Grading Scale'!B$5,'Grading Scale'!B$3))))))","v":3},{"$f":"Scores!B91","v":0},{"$f":"IF(S100>='Grading Scale'!B$13,IF(S100='Grading Scale'!B$3,'Grading Scale'!C$3,IF(S100='Grading Scale'!B$5,'Grading Scale'!C$5,IF(S100='Grading Scale'!B$7,'Grading Scale'!C$7,IF(S100='Grading Scale'!B$9,'Grading Scale'!C$9,IF(S100='Grading Scale'!B$11,'Grading Scale'!C$11,'Grading Scale'!C$13))))),IF(S100='Grading Scale'!E$3,'Grading Scale'!F$3,IF(S100='Grading Scale'!E$5,'Grading Scale'!F$5,IF(S100='Grading Scale'!E$7,'Grading Scale'!F$7,IF(S100='Grading Scale'!E$9,'Grading Scale'!F$9,IF(S100='Grading Scale'!E$11,'Grading Scale'!F$11,'Grading Scale'!F$13))))))","v":"B    "}," ",null,""]
[{"$f":"Scores!A92","v":0},{"$f":"Scores!B92","v":0},{"$f":"Scores!C92","v":0},{"$f":"Scores!D92","v":0},{"$f":"Scores!E92","v":0},{"$f":"Scores!F92","v":0},{"$f":"Scores!G92","v":0},{"$f":"Scores!H92","v":0},{"$f":"Scores!I92","v":0},{"$f":"Scores!J92","v":0},{"$f":"Scores!K92","v":0},{"$f":"Scores!L92","v":0},{"$f":"Scores!M92","v":0},{"$f":"Scores!N92","v":0},{"$f":"Scores!O92","v":0},-0.70710678118654746,2.9512994231491119,2.9512994231491119,{"$f":"IF(R101<'Grading Scale'!G$8,IF(R101<'Grading Scale'!G$13,'Grading Scale'!E$13,IF(R101<'Grading Scale'!G$12,'Grading Scale'!E$11,IF(R101<'Grading Scale'!G$11,'Grading Scale'!E$9,IF(R101<'Grading Scale'!G$10,'Grading Scale'!E$7,IF(R101<'Grading Scale'!G$9,'Grading Scale'!E$5,'Grading Scale'!E$3))))),IF(R101<'Grading Scale'!G$7,'Grading Scale'!B$13,IF(R101<'Grading Scale'!G$6,'Grading Scale'!B$11,IF(R101<'Grading Scale'!G$5,'Grading Scale'!B$9,IF(R101<'Grading Scale'!G$4,'Grading Scale'!B$7,IF(R101<'Grading Scale'!G$3,'Grading Scale'!B$5,'Grading Scale'!B$3))))))","v":3},{"$f":"Scores!B92","v":0},{"$f":"IF(S101>='Grading Scale'!B$13,IF(S101='Grading Scale'!B$3,'Grading Scale'!C$3,IF(S101='Grading Scale'!B$5,'Grading Scale'!C$5,IF(S101='Grading Scale'!B$7,'Grading Scale'!C$7,IF(S101='Grading Scale'!B$9,'Grading Scale'!C$9,IF(S101='Grading Scale'!B$11,'Grading Scale'!C$11,'Grading Scale'!C$13))))),IF(S101='Grading Scale'!E$3,'Grading Scale'!F$3,IF(S101='Grading Scale'!E$5,'Grading Scale'!F$5,IF(S101='Grading Scale'!E$7,'Grading Scale'!F$7,IF(S101='Grading Scale'!E$9,'Grading Scale'!F$9,IF(S101='Grading Scale'!E$11,'Grading Scale'!F$11,'Grading Scale'!F$13))))))","v":"B    "}," ",null,""]
[{"$f":"Scores!A93","v":0},{"$f":"Scores!B93","v":0},{"$f":"Scores!C93","v":0},{"$f":"Scores!D93","v":0},{"$f":"Scores!E93","v":0},{"$f":"Scores!F93","v":0},{"$f":"Scores!G93","v":0},{"$f":"Scores!H93","v":0},{"$f":"Scores!I93","v":0},{"$f":"Scores!J93","v":0},{"$f":"Scores!K93","v":0},{"$f":"Scores!L93","v":0},{"$f":"Scores!M93","v":0},{"$f":"Scores!N93","v":0},{"$f":"Scores!O93","v":0},-0.70710678118654746,2.9512994231491119,2.9512994231491119,{"$f":"IF(R102<'Grading Scale'!G$8,IF(R102<'Grading Scale'!G$13,'Grading Scale'!E$13,IF(R102<'Grading Scale'!G$12,'Grading Scale'!E$11,IF(R102<'Grading Scale'!G$11,'Grading Scale'!E$9,IF(R102<'Grading Scale'!G$10,'Grading Scale'!E$7,IF(R102<'Grading Scale'!G$9,'Grading Scale'!E$5,'Grading Scale'!E$3))))),IF(R102<'Grading Scale'!G$7,'Grading Scale'!B$13,IF(R102<'Grading Scale'!G$6,'Grading Scale'!B$11,IF(R102<'Grading Scale'!G$5,'Grading Scale'!B$9,IF(R102<'Grading Scale'!G$4,'Grading Scale'!B$7,IF(R102<'Grading Scale'!G$3,'Grading Scale'!B$5,'Grading Scale'!B$3))))))","v":3},{"$f":"Scores!B93","v":0},{"$f":"IF(S102>='Grading Scale'!B$13,IF(S102='Grading Scale'!B$3,'Grading Scale'!C$3,IF(S102='Grading Scale'!B$5,'Grading Scale'!C$5,IF(S102='Grading Scale'!B$7,'Grading Scale'!C$7,IF(S102='Grading Scale'!B$9,'Grading Scale'!C$9,IF(S102='Grading Scale'!B$11,'Grading Scale'!C$11,'Grading Scale'!C$13))))),IF(S102='Grading Scale'!E$3,'Grading Scale'!F$3,IF(S102='Grading Scale'!E$5,'Grading Scale'!F$5,IF(S102='Grading Scale'!E$7,'Grading Scale'!F$7,IF(S102='Grading Scale'!E$9,'Grading Scale'!F$9,IF(S102='Grading Scale'!E$11,'Grading Scale'!F$11,'Grading Scale'!F$13))))))","v":"B    "}," ",null,""]
[{"$f":"Scores!A94","v":0},{"$f":"Scores!B94","v":0},{"$f":"Scores!C94","v":0},{"$f":"Scores!D94","v":0},{"$f":"Scores!E94","v":0},{"$f":"Scores!F94","v":0},{"$f":"Scores!G94","v":0},{"$f":"Scores!H94","v":0},{"$f":"Scores!I94","v":0},{"$f":"Scores!J94","v":0},{"$f":"Scores!K94","v":0},{"$f":"Scores!L94","v":0},{"$f":"Scores!M94","v":0},{"$f":"Scores!N94","v":0},{"$f":"Scores!O94","v":0},-0.70710678118654746,2.9512994231491119,2.9512994231491119,{"$f":"IF(R103<'Grading Scale'!G$8,IF(R103<'Grading Scale'!G$13,'Grading Scale'!E$13,IF(R103<'Grading Scale'!G$12,'Grading Scale'!E$11,IF(R103<'Grading Scale'!G$11,'Grading Scale'!E$9,IF(R103<'Grading Scale'!G$10,'Grading Scale'!E$7,IF(R103<'Grading Scale'!G$9,'Grading Scale'!E$5,'Grading Scale'!E$3))))),IF(R103<'Grading Scale'!G$7,'Grading Scale'!B$13,IF(R103<'Grading Scale'!G$6,'Grading Scale'!B$11,IF(R103<'Grading Scale'!G$5,'Grading Scale'!B$9,IF(R103<'Grading Scale'!G$4,'Grading Scale'!B$7,IF(R103<'Grading Scale'!G$3,'Grading Scale'!B$5,'Grading Scale'!B$3))))))","v":3},{"$f":"Scores!B94","v":0},{"$f":"IF(S103>='Grading Scale'!B$13,IF(S103='Grading Scale'!B$3,'Grading Scale'!C$3,IF(S103='Grading Scale'!B$5,'Grading Scale'!C$5,IF(S103='Grading Scale'!B$7,'Grading Scale'!C$7,IF(S103='Grading Scale'!B$9,'Grading Scale'!C$9,IF(S103='Grading Scale'!B$11,'Grading Scale'!C$11,'Grading Scale'!C$13))))),IF(S103='Grading Scale'!E$3,'Grading Scale'!F$3,IF(S103='Grading Scale'!E$5,'Grading Scale'!F$5,IF(S103='Grading Scale'!E$7,'Grading Scale'!F$7,IF(S103='Grading Scale'!E$9,'Grading Scale'!F$9,IF(S103='Grading Scale'!E$11,'Grading Scale'!F$11,'Grading Scale'!F$13))))))","v":"B    "}," ",null,""]
[{"$f":"Scores!A95","v":0},{"$f":"Scores!B95","v":0},{"$f":"Scores!C95","v":0},{"$f":"Scores!D95","v":0},{"$f":"Scores!E95","v":0},{"$f":"Scores!F95","v":0},{"$f":"Scores!G95","v":0},{"$f":"Scores!H95","v":0},{"$f":"Scores!I95","v":0},{"$f":"Scores!J95","v":0},{"$f":"Scores!K95","v":0},{"$f":"Scores!L95","v":0},{"$f":"Scores!M95","v":0},{"$f":"Scores!N95","v":0},{"$f":"Scores!O95","v":0},-0.70710678118654746,2.9512994231491119,2.9512994231491119,{"$f":"IF(R104<'Grading Scale'!G$8,IF(R104<'Grading Scale'!G$13,'Grading Scale'!E$13,IF(R104<'Grading Scale'!G$12,'Grading Scale'!E$11,IF(R104<'Grading Scale'!G$11,'Grading Scale'!E$9,IF(R104<'Grading Scale'!G$10,'Grading Scale'!E$7,IF(R104<'Grading Scale'!G$9,'Grading Scale'!E$5,'Grading Scale'!E$3))))),IF(R104<'Grading Scale'!G$7,'Grading Scale'!B$13,IF(R104<'Grading Scale'!G$6,'Grading Scale'!B$11,IF(R104<'Grading Scale'!G$5,'Grading Scale'!B$9,IF(R104<'Grading Scale'!G$4,'Grading Scale'!B$7,IF(R104<'Grading Scale'!G$3,'Grading Scale'!B$5,'Grading Scale'!B$3))))))","v":3},{"$f":"Scores!B95","v":0},{"$f":"IF(S104>='Grading Scale'!B$13,IF(S104='Grading Scale'!B$3,'Grading Scale'!C$3,IF(S104='Grading Scale'!B$5,'Grading Scale'!C$5,IF(S104='Grading Scale'!B$7,'Grading Scale'!C$7,IF(S104='Grading Scale'!B$9,'Grading Scale'!C$9,IF(S104='Grading Scale'!B$11,'Grading Scale'!C$11,'Grading Scale'!C$13))))),IF(S104='Grading Scale'!E$3,'Grading Scale'!F$3,IF(S104='Grading Scale'!E$5,'Grading Scale'!F$5,IF(S104='Grading Scale'!E$7,'Grading Scale'!F$7,IF(S104='Grading Scale'!E$9,'Grading Scale'!F$9,IF(S104='Grading Scale'!E$11,'Grading Scale'!F$11,'Grading Scale'!F$13))))))","v":"B    "}," ",null,""]
[{"$f":"Scores!A96","v":0},{"$f":"Scores!B96","v":0},{"$f":"Scores!C96","v":0},{"$f":"Scores!D96","v":0},{"$f":"Scores!E96","v":0},{"$f":"Scores!F96","v":0},{"$f":"Scores!G96","v":0},{"$f":"Scores!H96","v":0},{"$f":"Scores!I96","v":0},{"$f":"Scores!J96","v":0},{"$f":"Scores!K96","v":0},{"$f":"Scores!L96","v":0},{"$f":"Scores!M96","v":0},{"$f":"Scores!N96","v":0},{"$f":"Scores!O96","v":0},-0.70710678118654746,2.9512994231491119,2.9512994231491119,{"$f":"IF(R105<'Grading Scale'!G$8,IF(R105<'Grading Scale'!G$13,'Grading Scale'!E$13,IF(R105<'Grading Scale'!G$12,'Grading Scale'!E$11,IF(R105<'Grading Scale'!G$11,'Grading Scale'!E$9,IF(R105<'Grading Scale'!G$10,'Grading Scale'!E$7,IF(R105<'Grading Scale'!G$9,'Grading Scale'!E$5,'Grading Scale'!E$3))))),IF(R105<'Grading Scale'!G$7,'Grading Scale'!B$13,IF(R105<'Grading Scale'!G$6,'Grading Scale'!B$11,IF(R105<'Grading Scale'!G$5,'Grading Scale'!B$9,IF(R105<'Grading Scale'!G$4,'Grading Scale'!B$7,IF(R105<'Grading Scale'!G$3,'Grading Scale'!B$5,'Grading Scale'!B$3))))))","v":3},{"$f":"Scores!B96","v":0},{"$f":"IF(S105>='Grading Scale'!B$13,IF(S105='Grading Scale'!B$3,'Grading Scale'!C$3,IF(S105='Grading Scale'!B$5,'Grading Scale'!C$5,IF(S105='Grading Scale'!B$7,'Grading Scale'!C$7,IF(S105='Grading Scale'!B$9,'Grading Scale'!C$9,IF(S105='Grading Scale'!B$11,'Grading Scale'!C$11,'Grading Scale'!C$13))))),IF(S105='Grading Scale'!E$3,'Grading Scale'!F$3,IF(S105='Grading Scale'!E$5,'Grading Scale'!F$5,IF(S105='Grading Scale'!E$7,'Grading Scale'!F$7,IF(S105='Grading Scale'!E$9,'Grading Scale'!F$9,IF(S105='Grading Scale'!E$11,'Grading Scale'!F$11,'Grading Scale'!F$13))))))","v":"B    "}," ",null,""]
[{"$f":"Scores!A97","v":0},{"$f":"Scores!B97","v":0},{"$f":"Scores!C97","v":0},{"$f":"Scores!D97","v":0},{"$f":"Scores!E97","v":0},{"$f":"Scores!F97","v":0},{"$f":"Scores!G97","v":0},{"$f":"Scores!H97","v":0},{"$f":"Scores!I97","v":0},{"$f":"Scores!J97","v":0},{"$f":"Scores!K97","v":0},{"$f":"Scores!L97","v":0},{"$f":"Scores!M97","v":0},{"$f":"Scores!N97","v":0},{"$f":"Scores!O97","v":0},-0.70710678118654746,2.9512994231491119,2.9512994231491119,{"$f":"IF(R106<'Grading Scale'!G$8,IF(R106<'Grading Scale'!G$13,'Grading Scale'!E$13,IF(R106<'Grading Scale'!G$12,'Grading Scale'!E$11,IF(R106<'Grading Scale'!G$11,'Grading Scale'!E$9,IF(R106<'Grading Scale'!G$10,'Grading Scale'!E$7,IF(R106<'Grading Scale'!G$9,'Grading Scale'!E$5,'Grading Scale'!E$3))))),IF(R106<'Grading Scale'!G$7,'Grading Scale'!B$13,IF(R106<'Grading Scale'!G$6,'Grading Scale'!B$11,IF(R106<'Grading Scale'!G$5,'Grading Scale'!B$9,IF(R106<'Grading Scale'!G$4,'Grading Scale'!B$7,IF(R106<'Grading Scale'!G$3,'Grading Scale'!B$5,'Grading Scale'!B$3))))))","v":3},{"$f":"Scores!B97","v":0},{"$f":"IF(S106>='Grading Scale'!B$13,IF(S106='Grading Scale'!B$3,'Grading Scale'!C$3,IF(S106='Grading Scale'!B$5,'Grading Scale'!C$5,IF(S106='Grading Scale'!B$7,'Grading Scale'!C$7,IF(S106='Grading Scale'!B$9,'Grading Scale'!C$9,IF(S106='Grading Scale'!B$11,'Grading Scale'!C$11,'Grading Scale'!C$13))))),IF(S106='Grading Scale'!E$3,'Grading Scale'!F$3,IF(S106='Grading Scale'!E$5,'Grading Scale'!F$5,IF(S106='Grading Scale'!E$7,'Grading Scale'!F$7,IF(S106='Grading Scale'!E$9,'Grading Scale'!F$9,IF(S106='Grading Scale'!E$11,'Grading Scale'!F$11,'Grading Scale'!F$13))))))","v":"B    "}," ",null,""]
[{"$f":"Scores!A98","v":0},{"$f":"Scores!B98","v":0},{"$f":"Scores!C98","v":0},{"$f":"Scores!D98","v":0},{"$f":"Scores!E98","v":0},{"$f":"Scores!F98","v":0},{"$f":"Scores!G98","v":0},{"$f":"Scores!H98","v":0},{"$f":"Scores!I98","v":0},{"$f":"Scores!J98","v":0},{"$f":"Scores!K98","v":0},{"$f":"Scores!L98","v":0},{"$f":"Scores!M98","v":0},{"$f":"Scores!N98","v":0},{"$f":"Scores!O98","v":0},-0.70710678118654746,2.9512994231491119,2.9512994231491119,{"$f":"IF(R107<'Grading Scale'!G$8,IF(R107<'Grading Scale'!G$13,'Grading Scale'!E$13,IF(R107<'Grading Scale'!G$12,'Grading Scale'!E$11,IF(R107<'Grading Scale'!G$11,'Grading Scale'!E$9,IF(R107<'Grading Scale'!G$10,'Grading Scale'!E$7,IF(R107<'Grading Scale'!G$9,'Grading Scale'!E$5,'Grading Scale'!E$3))))),IF(R107<'Grading Scale'!G$7,'Grading Scale'!B$13,IF(R107<'Grading Scale'!G$6,'Grading Scale'!B$11,IF(R107<'Grading Scale'!G$5,'Grading Scale'!B$9,IF(R107<'Grading Scale'!G$4,'Grading Scale'!B$7,IF(R107<'Grading Scale'!G$3,'Grading Scale'!B$5,'Grading Scale'!B$3))))))","v":3},{"$f":"Scores!B98","v":0},{"$f":"IF(S107>='Grading Scale'!B$13,IF(S107='Grading Scale'!B$3,'Grading Scale'!C$3,IF(S107='Grading Scale'!B$5,'Grading Scale'!C$5,IF(S107='Grading Scale'!B$7,'Grading Scale'!C$7,IF(S107='Grading Scale'!B$9,'Grading Scale'!C$9,IF(S107='Grading Scale'!B$11,'Grading Scale'!C$11,'Grading Scale'!C$13))))),IF(S107='Grading Scale'!E$3,'Grading Scale'!F$3,IF(S107='Grading Scale'!E$5,'Grading Scale'!F$5,IF(S107='Grading Scale'!E$7,'Grading Scale'!F$7,IF(S107='Grading Scale'!E$9,'Grading Scale'!F$9,IF(S107='Grading Scale'!E$11,'Grading Scale'!F$11,'Grading Scale'!F$13))))))","v":"B    "}," ",null,""]
[{"$f":"Scores!A99","v":0},{"$f":"Scores!B99","v":0},{"$f":"Scores!C99","v":0},{"$f":"Scores!D99","v":0},{"$f":"Scores!E99","v":0},{"$f":"Scores!F99","v":0},{"$f":"Scores!G99","v":0},{"$f":"Scores!H99","v":0},{"$f":"Scores!I99","v":0},{"$f":"Scores!J99","v":0},{"$f":"Scores!K99","v":0},{"$f":"Scores!L99","v":0},{"$f":"Scores!M99","v":0},{"$f":"Scores!N99","v":0},{"$f":"Scores!O99","v":0},-0.70710678118654746,2.9512994231491119,2.9512994231491119,{"$f":"IF(R108<'Grading Scale'!G$8,IF(R108<'Grading Scale'!G$13,'Grading Scale'!E$13,IF(R108<'Grading Scale'!G$12,'Grading Scale'!E$11,IF(R108<'Grading Scale'!G$11,'Grading Scale'!E$9,IF(R108<'Grading Scale'!G$10,'Grading Scale'!E$7,IF(R108<'Grading Scale'!G$9,'Grading Scale'!E$5,'Grading Scale'!E$3))))),IF(R108<'Grading Scale'!G$7,'Grading Scale'!B$13,IF(R108<'Grading Scale'!G$6,'Grading Scale'!B$11,IF(R108<'Grading Scale'!G$5,'Grading Scale'!B$9,IF(R108<'Grading Scale'!G$4,'Grading Scale'!B$7,IF(R108<'Grading Scale'!G$3,'Grading Scale'!B$5,'Grading Scale'!B$3))))))","v":3},{"$f":"Scores!B99","v":0},{"$f":"IF(S108>='Grading Scale'!B$13,IF(S108='Grading Scale'!B$3,'Grading Scale'!C$3,IF(S108='Grading Scale'!B$5,'Grading Scale'!C$5,IF(S108='Grading Scale'!B$7,'Grading Scale'!C$7,IF(S108='Grading Scale'!B$9,'Grading Scale'!C$9,IF(S108='Grading Scale'!B$11,'Grading Scale'!C$11,'Grading Scale'!C$13))))),IF(S108='Grading Scale'!E$3,'Grading Scale'!F$3,IF(S108='Grading Scale'!E$5,'Grading Scale'!F$5,IF(S108='Grading Scale'!E$7,'Grading Scale'!F$7,IF(S108='Grading Scale'!E$9,'Grading Scale'!F$9,IF(S108='Grading Scale'!E$11,'Grading Scale'!F$11,'Grading Scale'!F$13))))))","v":"B    "}," ",null,""]
[{"$f":"Scores!A100","v":0},{"$f":"Scores!B100","v":0},{"$f":"Scores!C100","v":0},{"$f":"Scores!D100","v":0},{"$f":"Scores!E100","v":0},{"$f":"Scores!F100","v":0},{"$f":"Scores!G100","v":0},{"$f":"Scores!H100","v":0},{"$f":"Scores!I100","v":0},{"$f":"Scores!J100","v":0},{"$f":"Scores!K100","v":0},{"$f":"Scores!L100","v":0},{"$f":"Scores!M100","v":0},{"$f":"Scores!N100","v":0},{"$f":"Scores!O100","v":0},-0.70710678118654746,2.9512994231491119,2.9512994231491119,{"$f":"IF(R109<'Grading Scale'!G$8,IF(R109<'Grading Scale'!G$13,'Grading Scale'!E$13,IF(R109<'Grading Scale'!G$12,'Grading Scale'!E$11,IF(R109<'Grading Scale'!G$11,'Grading Scale'!E$9,IF(R109<'Grading Scale'!G$10,'Grading Scale'!E$7,IF(R109<'Grading Scale'!G$9,'Grading Scale'!E$5,'Grading Scale'!E$3))))),IF(R109<'Grading Scale'!G$7,'Grading Scale'!B$13,IF(R109<'Grading Scale'!G$6,'Grading Scale'!B$11,IF(R109<'Grading Scale'!G$5,'Grading Scale'!B$9,IF(R109<'Grading Scale'!G$4,'Grading Scale'!B$7,IF(R109<'Grading Scale'!G$3,'Grading Scale'!B$5,'Grading Scale'!B$3))))))","v":3},{"$f":"Scores!B100","v":0},{"$f":"IF(S109>='Grading Scale'!B$13,IF(S109='Grading Scale'!B$3,'Grading Scale'!C$3,IF(S109='Grading Scale'!B$5,'Grading Scale'!C$5,IF(S109='Grading Scale'!B$7,'Grading Scale'!C$7,IF(S109='Grading Scale'!B$9,'Grading Scale'!C$9,IF(S109='Grading Scale'!B$11,'Grading Scale'!C$11,'Grading Scale'!C$13))))),IF(S109='Grading Scale'!E$3,'Grading Scale'!F$3,IF(S109='Grading Scale'!E$5,'Grading Scale'!F$5,IF(S109='Grading Scale'!E$7,'Grading Scale'!F$7,IF(S109='Grading Scale'!E$9,'Grading Scale'!F$9,IF(S109='Grading Scale'!E$11,'Grading Scale'!F$11,'Grading Scale'!F$13))))))","v":"B    "}," ",null,""]
[{"$f":"Scores!A101","v":0},{"$f":"Scores!B101","v":0},{"$f":"Scores!C101","v":0},{"$f":"Scores!D101","v":0},{"$f":"Scores!E101","v":0},{"$f":"Scores!F101","v":0},{"$f":"Scores!G101","v":0},{"$f":"Scores!H101","v":0},{"$f":"Scores!I101","v":0},{"$f":"Scores!J101","v":0},{"$f":"Scores!K101","v":0},{"$f":"Scores!L101","v":0},{"$f":"Scores!M101","v":0},{"$f":"Scores!N101","v":0},{"$f":"Scores!O101","v":0},-0.70710678118654746,2.9512994231491119,2.9512994231491119,{"$f":"IF(R110<'Grading Scale'!G$8,IF(R110<'Grading Scale'!G$13,'Grading Scale'!E$13,IF(R110<'Grading Scale'!G$12,'Grading Scale'!E$11,IF(R110<'Grading Scale'!G$11,'Grading Scale'!E$9,IF(R110<'Grading Scale'!G$10,'Grading Scale'!E$7,IF(R110<'Grading Scale'!G$9,'Grading Scale'!E$5,'Grading Scale'!E$3))))),IF(R110<'Grading Scale'!G$7,'Grading Scale'!B$13,IF(R110<'Grading Scale'!G$6,'Grading Scale'!B$11,IF(R110<'Grading Scale'!G$5,'Grading Scale'!B$9,IF(R110<'Grading Scale'!G$4,'Grading Scale'!B$7,IF(R110<'Grading Scale'!G$3,'Grading Scale'!B$5,'Grading Scale'!B$3))))))","v":3},{"$f":"Scores!B101","v":0},{"$f":"IF(S110>='Grading Scale'!B$13,IF(S110='Grading Scale'!B$3,'Grading Scale'!C$3,IF(S110='Grading Scale'!B$5,'Grading Scale'!C$5,IF(S110='Grading Scale'!B$7,'Grading Scale'!C$7,IF(S110='Grading Scale'!B$9,'Grading Scale'!C$9,IF(S110='Grading Scale'!B$11,'Grading Scale'!C$11,'Grading Scale'!C$13))))),IF(S110='Grading Scale'!E$3,'Grading Scale'!F$3,IF(S110='Grading Scale'!E$5,'Grading Scale'!F$5,IF(S110='Grading Scale'!E$7,'Grading Scale'!F$7,IF(S110='Grading Scale'!E$9,'Grading Scale'!F$9,IF(S110='Grading Scale'!E$11,'Grading Scale'!F$11,'Grading Scale'!F$13))))))","v":"B    "}," ",null,""]
[{"$f":"Scores!A102","v":0},{"$f":"Scores!B102","v":0},{"$f":"Scores!C102","v":0},{"$f":"Scores!D102","v":0},{"$f":"Scores!E102","v":0},{"$f":"Scores!F102","v":0},{"$f":"Scores!G102","v":0},{"$f":"Scores!H102","v":0},{"$f":"Scores!I102","v":0},{"$f":"Scores!J102","v":0},{"$f":"Scores!K102","v":0},{"$f":"Scores!L102","v":0},{"$f":"Scores!M102","v":0},{"$f":"Scores!N102","v":0},{"$f":"Scores!O102","v":0},-0.70710678118654746,2.9512994231491119,2.9512994231491119,{"$f":"IF(R111<'Grading Scale'!G$8,IF(R111<'Grading Scale'!G$13,'Grading Scale'!E$13,IF(R111<'Grading Scale'!G$12,'Grading Scale'!E$11,IF(R111<'Grading Scale'!G$11,'Grading Scale'!E$9,IF(R111<'Grading Scale'!G$10,'Grading Scale'!E$7,IF(R111<'Grading Scale'!G$9,'Grading Scale'!E$5,'Grading Scale'!E$3))))),IF(R111<'Grading Scale'!G$7,'Grading Scale'!B$13,IF(R111<'Grading Scale'!G$6,'Grading Scale'!B$11,IF(R111<'Grading Scale'!G$5,'Grading Scale'!B$9,IF(R111<'Grading Scale'!G$4,'Grading Scale'!B$7,IF(R111<'Grading Scale'!G$3,'Grading Scale'!B$5,'Grading Scale'!B$3))))))","v":3},{"$f":"Scores!B102","v":0},{"$f":"IF(S111>='Grading Scale'!B$13,IF(S111='Grading Scale'!B$3,'Grading Scale'!C$3,IF(S111='Grading Scale'!B$5,'Grading Scale'!C$5,IF(S111='Grading Scale'!B$7,'Grading Scale'!C$7,IF(S111='Grading Scale'!B$9,'Grading Scale'!C$9,IF(S111='Grading Scale'!B$11,'Grading Scale'!C$11,'Grading Scale'!C$13))))),IF(S111='Grading Scale'!E$3,'Grading Scale'!F$3,IF(S111='Grading Scale'!E$5,'Grading Scale'!F$5,IF(S111='Grading Scale'!E$7,'Grading Scale'!F$7,IF(S111='Grading Scale'!E$9,'Grading Scale'!F$9,IF(S111='Grading Scale'!E$11,'Grading Scale'!F$11,'Grading Scale'!F$13))))))","v":"B    "}," ",null,""]
[{"$f":"Scores!A103","v":0},{"$f":"Scores!B103","v":0},{"$f":"Scores!C103","v":0},{"$f":"Scores!D103","v":0},{"$f":"Scores!E103","v":0},{"$f":"Scores!F103","v":0},{"$f":"Scores!G103","v":0},{"$f":"Scores!H103","v":0},{"$f":"Scores!I103","v":0},{"$f":"Scores!J103","v":0},{"$f":"Scores!K103","v":0},{"$f":"Scores!L103","v":0},{"$f":"Scores!M103","v":0},{"$f":"Scores!N103","v":0},{"$f":"Scores!O103","v":0},-0.70710678118654746,2.9512994231491119,2.9512994231491119,{"$f":"IF(R112<'Grading Scale'!G$8,IF(R112<'Grading Scale'!G$13,'Grading Scale'!E$13,IF(R112<'Grading Scale'!G$12,'Grading Scale'!E$11,IF(R112<'Grading Scale'!G$11,'Grading Scale'!E$9,IF(R112<'Grading Scale'!G$10,'Grading Scale'!E$7,IF(R112<'Grading Scale'!G$9,'Grading Scale'!E$5,'Grading Scale'!E$3))))),IF(R112<'Grading Scale'!G$7,'Grading Scale'!B$13,IF(R112<'Grading Scale'!G$6,'Grading Scale'!B$11,IF(R112<'Grading Scale'!G$5,'Grading Scale'!B$9,IF(R112<'Grading Scale'!G$4,'Grading Scale'!B$7,IF(R112<'Grading Scale'!G$3,'Grading Scale'!B$5,'Grading Scale'!B$3))))))","v":3},{"$f":"Scores!B103","v":0},{"$f":"IF(S112>='Grading Scale'!B$13,IF(S112='Grading Scale'!B$3,'Grading Scale'!C$3,IF(S112='Grading Scale'!B$5,'Grading Scale'!C$5,IF(S112='Grading Scale'!B$7,'Grading Scale'!C$7,IF(S112='Grading Scale'!B$9,'Grading Scale'!C$9,IF(S112='Grading Scale'!B$11,'Grading Scale'!C$11,'Grading Scale'!C$13))))),IF(S112='Grading Scale'!E$3,'Grading Scale'!F$3,IF(S112='Grading Scale'!E$5,'Grading Scale'!F$5,IF(S112='Grading Scale'!E$7,'Grading Scale'!F$7,IF(S112='Grading Scale'!E$9,'Grading Scale'!F$9,IF(S112='Grading Scale'!E$11,'Grading Scale'!F$11,'Grading Scale'!F$13))))))","v":"B    "}," ",null,""]
[{"$f":"Scores!A104","v":0},{"$f":"Scores!B104","v":0},{"$f":"Scores!C104","v":0},{"$f":"Scores!D104","v":0},{"$f":"Scores!E104","v":0},{"$f":"Scores!F104","v":0},{"$f":"Scores!G104","v":0},{"$f":"Scores!H104","v":0},{"$f":"Scores!I104","v":0},{"$f":"Scores!J104","v":0},{"$f":"Scores!K104","v":0},{"$f":"Scores!L104","v":0},{"$f":"Scores!M104","v":0},{"$f":"Scores!N104","v":0},{"$f":"Scores!O104","v":0},-0.70710678118654746,2.9512994231491119,2.9512994231491119,{"$f":"IF(R113<'Grading Scale'!G$8,IF(R113<'Grading Scale'!G$13,'Grading Scale'!E$13,IF(R113<'Grading Scale'!G$12,'Grading Scale'!E$11,IF(R113<'Grading Scale'!G$11,'Grading Scale'!E$9,IF(R113<'Grading Scale'!G$10,'Grading Scale'!E$7,IF(R113<'Grading Scale'!G$9,'Grading Scale'!E$5,'Grading Scale'!E$3))))),IF(R113<'Grading Scale'!G$7,'Grading Scale'!B$13,IF(R113<'Grading Scale'!G$6,'Grading Scale'!B$11,IF(R113<'Grading Scale'!G$5,'Grading Scale'!B$9,IF(R113<'Grading Scale'!G$4,'Grading Scale'!B$7,IF(R113<'Grading Scale'!G$3,'Grading Scale'!B$5,'Grading Scale'!B$3))))))","v":3},{"$f":"Scores!B104","v":0},{"$f":"IF(S113>='Grading Scale'!B$13,IF(S113='Grading Scale'!B$3,'Grading Scale'!C$3,IF(S113='Grading Scale'!B$5,'Grading Scale'!C$5,IF(S113='Grading Scale'!B$7,'Grading Scale'!C$7,IF(S113='Grading Scale'!B$9,'Grading Scale'!C$9,IF(S113='Grading Scale'!B$11,'Grading Scale'!C$11,'Grading Scale'!C$13))))),IF(S113='Grading Scale'!E$3,'Grading Scale'!F$3,IF(S113='Grading Scale'!E$5,'Grading Scale'!F$5,IF(S113='Grading Scale'!E$7,'Grading Scale'!F$7,IF(S113='Grading Scale'!E$9,'Grading Scale'!F$9,IF(S113='Grading Scale'!E$11,'Grading Scale'!F$11,'Grading Scale'!F$13))))))","v":"B    "}," ",null,""]
[{"$f":"Scores!A105","v":0},{"$f":"Scores!B105","v":0},{"$f":"Scores!C105","v":0},{"$f":"Scores!D105","v":0},{"$f":"Scores!E105","v":0},{"$f":"Scores!F105","v":0},{"$f":"Scores!G105","v":0},{"$f":"Scores!H105","v":0},{"$f":"Scores!I105","v":0},{"$f":"Scores!J105","v":0},{"$f":"Scores!K105","v":0},{"$f":"Scores!L105","v":0},{"$f":"Scores!M105","v":0},{"$f":"Scores!N105","v":0},{"$f":"Scores!O105","v":0},-0.70710678118654746,2.9512994231491119,2.9512994231491119,{"$f":"IF(R114<'Grading Scale'!G$8,IF(R114<'Grading Scale'!G$13,'Grading Scale'!E$13,IF(R114<'Grading Scale'!G$12,'Grading Scale'!E$11,IF(R114<'Grading Scale'!G$11,'Grading Scale'!E$9,IF(R114<'Grading Scale'!G$10,'Grading Scale'!E$7,IF(R114<'Grading Scale'!G$9,'Grading Scale'!E$5,'Grading Scale'!E$3))))),IF(R114<'Grading Scale'!G$7,'Grading Scale'!B$13,IF(R114<'Grading Scale'!G$6,'Grading Scale'!B$11,IF(R114<'Grading Scale'!G$5,'Grading Scale'!B$9,IF(R114<'Grading Scale'!G$4,'Grading Scale'!B$7,IF(R114<'Grading Scale'!G$3,'Grading Scale'!B$5,'Grading Scale'!B$3))))))","v":3},{"$f":"Scores!B105","v":0},{"$f":"IF(S114>='Grading Scale'!B$13,IF(S114='Grading Scale'!B$3,'Grading Scale'!C$3,IF(S114='Grading Scale'!B$5,'Grading Scale'!C$5,IF(S114='Grading Scale'!B$7,'Grading Scale'!C$7,IF(S114='Grading Scale'!B$9,'Grading Scale'!C$9,IF(S114='Grading Scale'!B$11,'Grading Scale'!C$11,'Grading Scale'!C$13))))),IF(S114='Grading Scale'!E$3,'Grading Scale'!F$3,IF(S114='Grading Scale'!E$5,'Grading Scale'!F$5,IF(S114='Grading Scale'!E$7,'Grading Scale'!F$7,IF(S114='Grading Scale'!E$9,'Grading Scale'!F$9,IF(S114='Grading Scale'!E$11,'Grading Scale'!F$11,'Grading Scale'!F$13))))))","v":"B    "}," ",null,""]
[{"$f":"Scores!A106","v":0},{"$f":"Scores!B106","v":0},{"$f":"Scores!C106","v":0},{"$f":"Scores!D106","v":0},{"$f":"Scores!E106","v":0},{"$f":"Scores!F106","v":0},{"$f":"Scores!G106","v":0},{"$f":"Scores!H106","v":0},{"$f":"Scores!I106","v":0},{"$f":"Scores!J106","v":0},{"$f":"Scores!K106","v":0},{"$f":"Scores!L106","v":0},{"$f":"Scores!M106","v":0},{"$f":"Scores!N106","v":0},{"$f":"Scores!O106","v":0},-0.70710678118654746,2.9512994231491119,2.9512994231491119,{"$f":"IF(R115<'Grading Scale'!G$8,IF(R115<'Grading Scale'!G$13,'Grading Scale'!E$13,IF(R115<'Grading Scale'!G$12,'Grading Scale'!E$11,IF(R115<'Grading Scale'!G$11,'Grading Scale'!E$9,IF(R115<'Grading Scale'!G$10,'Grading Scale'!E$7,IF(R115<'Grading Scale'!G$9,'Grading Scale'!E$5,'Grading Scale'!E$3))))),IF(R115<'Grading Scale'!G$7,'Grading Scale'!B$13,IF(R115<'Grading Scale'!G$6,'Grading Scale'!B$11,IF(R115<'Grading Scale'!G$5,'Grading Scale'!B$9,IF(R115<'Grading Scale'!G$4,'Grading Scale'!B$7,IF(R115<'Grading Scale'!G$3,'Grading Scale'!B$5,'Grading Scale'!B$3))))))","v":3},{"$f":"Scores!B106","v":0},{"$f":"IF(S115>='Grading Scale'!B$13,IF(S115='Grading Scale'!B$3,'Grading Scale'!C$3,IF(S115='Grading Scale'!B$5,'Grading Scale'!C$5,IF(S115='Grading Scale'!B$7,'Grading Scale'!C$7,IF(S115='Grading Scale'!B$9,'Grading Scale'!C$9,IF(S115='Grading Scale'!B$11,'Grading Scale'!C$11,'Grading Scale'!C$13))))),IF(S115='Grading Scale'!E$3,'Grading Scale'!F$3,IF(S115='Grading Scale'!E$5,'Grading Scale'!F$5,IF(S115='Grading Scale'!E$7,'Grading Scale'!F$7,IF(S115='Grading Scale'!E$9,'Grading Scale'!F$9,IF(S115='Grading Scale'!E$11,'Grading Scale'!F$11,'Grading Scale'!F$13))))))","v":"B    "}," ",null,""]
[{"$f":"Scores!A107","v":0},{"$f":"Scores!B107","v":0},{"$f":"Scores!C107","v":0},{"$f":"Scores!D107","v":0},{"$f":"Scores!E107","v":0},{"$f":"Scores!F107","v":0},{"$f":"Scores!G107","v":0},{"$f":"Scores!H107","v":0},{"$f":"Scores!I107","v":0},{"$f":"Scores!J107","v":0},{"$f":"Scores!K107","v":0},{"$f":"Scores!L107","v":0},{"$f":"Scores!M107","v":0},{"$f":"Scores!N107","v":0},{"$f":"Scores!O107","v":0},-0.70710678118654746,2.9512994231491119,2.9512994231491119,{"$f":"IF(R116<'Grading Scale'!G$8,IF(R116<'Grading Scale'!G$13,'Grading Scale'!E$13,IF(R116<'Grading Scale'!G$12,'Grading Scale'!E$11,IF(R116<'Grading Scale'!G$11,'Grading Scale'!E$9,IF(R116<'Grading Scale'!G$10,'Grading Scale'!E$7,IF(R116<'Grading Scale'!G$9,'Grading Scale'!E$5,'Grading Scale'!E$3))))),IF(R116<'Grading Scale'!G$7,'Grading Scale'!B$13,IF(R116<'Grading Scale'!G$6,'Grading Scale'!B$11,IF(R116<'Grading Scale'!G$5,'Grading Scale'!B$9,IF(R116<'Grading Scale'!G$4,'Grading Scale'!B$7,IF(R116<'Grading Scale'!G$3,'Grading Scale'!B$5,'Grading Scale'!B$3))))))","v":3},{"$f":"Scores!B107","v":0},{"$f":"IF(S116>='Grading Scale'!B$13,IF(S116='Grading Scale'!B$3,'Grading Scale'!C$3,IF(S116='Grading Scale'!B$5,'Grading Scale'!C$5,IF(S116='Grading Scale'!B$7,'Grading Scale'!C$7,IF(S116='Grading Scale'!B$9,'Grading Scale'!C$9,IF(S116='Grading Scale'!B$11,'Grading Scale'!C$11,'Grading Scale'!C$13))))),IF(S116='Grading Scale'!E$3,'Grading Scale'!F$3,IF(S116='Grading Scale'!E$5,'Grading Scale'!F$5,IF(S116='Grading Scale'!E$7,'Grading Scale'!F$7,IF(S116='Grading Scale'!E$9,'Grading Scale'!F$9,IF(S116='Grading Scale'!E$11,'Grading Scale'!F$11,'Grading Scale'!F$13))))))","v":"B    "}," ",null,""]
[{"$f":"Scores!A108","v":0},{"$f":"Scores!B108","v":0},{"$f":"Scores!C108","v":0},{"$f":"Scores!D108","v":0},{"$f":"Scores!E108","v":0},{"$f":"Scores!F108","v":0},{"$f":"Scores!G108","v":0},{"$f":"Scores!H108","v":0},{"$f":"Scores!I108","v":0},{"$f":"Scores!J108","v":0},{"$f":"Scores!K108","v":0},{"$f":"Scores!L108","v":0},{"$f":"Scores!M108","v":0},{"$f":"Scores!N108","v":0},{"$f":"Scores!O108","v":0},-0.70710678118654746,2.9512994231491119,2.9512994231491119,{"$f":"IF(R117<'Grading Scale'!G$8,IF(R117<'Grading Scale'!G$13,'Grading Scale'!E$13,IF(R117<'Grading Scale'!G$12,'Grading Scale'!E$11,IF(R117<'Grading Scale'!G$11,'Grading Scale'!E$9,IF(R117<'Grading Scale'!G$10,'Grading Scale'!E$7,IF(R117<'Grading Scale'!G$9,'Grading Scale'!E$5,'Grading Scale'!E$3))))),IF(R117<'Grading Scale'!G$7,'Grading Scale'!B$13,IF(R117<'Grading Scale'!G$6,'Grading Scale'!B$11,IF(R117<'Grading Scale'!G$5,'Grading Scale'!B$9,IF(R117<'Grading Scale'!G$4,'Grading Scale'!B$7,IF(R117<'Grading Scale'!G$3,'Grading Scale'!B$5,'Grading Scale'!B$3))))))","v":3},{"$f":"Scores!B108","v":0},{"$f":"IF(S117>='Grading Scale'!B$13,IF(S117='Grading Scale'!B$3,'Grading Scale'!C$3,IF(S117='Grading Scale'!B$5,'Grading Scale'!C$5,IF(S117='Grading Scale'!B$7,'Grading Scale'!C$7,IF(S117='Grading Scale'!B$9,'Grading Scale'!C$9,IF(S117='Grading Scale'!B$11,'Grading Scale'!C$11,'Grading Scale'!C$13))))),IF(S117='Grading Scale'!E$3,'Grading Scale'!F$3,IF(S117='Grading Scale'!E$5,'Grading Scale'!F$5,IF(S117='Grading Scale'!E$7,'Grading Scale'!F$7,IF(S117='Grading Scale'!E$9,'Grading Scale'!F$9,IF(S117='Grading Scale'!E$11,'Grading Scale'!F$11,'Grading Scale'!F$13))))))","v":"B    "}," ",null,""]
[{"$f":"Scores!A109","v":0},{"$f":"Scores!B109","v":0},{"$f":"Scores!C109","v":0},{"$f":"Scores!D109","v":0},{"$f":"Scores!E109","v":0},{"$f":"Scores!F109","v":0},{"$f":"Scores!G109","v":0},{"$f":"Scores!H109","v":0},{"$f":"Scores!I109","v":0},{"$f":"Scores!J109","v":0},{"$f":"Scores!K109","v":0},{"$f":"Scores!L109","v":0},{"$f":"Scores!M109","v":0},{"$f":"Scores!N109","v":0},{"$f":"Scores!O109","v":0},-0.70710678118654746,2.9512994231491119,2.9512994231491119,{"$f":"IF(R118<'Grading Scale'!G$8,IF(R118<'Grading Scale'!G$13,'Grading Scale'!E$13,IF(R118<'Grading Scale'!G$12,'Grading Scale'!E$11,IF(R118<'Grading Scale'!G$11,'Grading Scale'!E$9,IF(R118<'Grading Scale'!G$10,'Grading Scale'!E$7,IF(R118<'Grading Scale'!G$9,'Grading Scale'!E$5,'Grading Scale'!E$3))))),IF(R118<'Grading Scale'!G$7,'Grading Scale'!B$13,IF(R118<'Grading Scale'!G$6,'Grading Scale'!B$11,IF(R118<'Grading Scale'!G$5,'Grading Scale'!B$9,IF(R118<'Grading Scale'!G$4,'Grading Scale'!B$7,IF(R118<'Grading Scale'!G$3,'Grading Scale'!B$5,'Grading Scale'!B$3))))))","v":3},{"$f":"Scores!B109","v":0},{"$f":"IF(S118>='Grading Scale'!B$13,IF(S118='Grading Scale'!B$3,'Grading Scale'!C$3,IF(S118='Grading Scale'!B$5,'Grading Scale'!C$5,IF(S118='Grading Scale'!B$7,'Grading Scale'!C$7,IF(S118='Grading Scale'!B$9,'Grading Scale'!C$9,IF(S118='Grading Scale'!B$11,'Grading Scale'!C$11,'Grading Scale'!C$13))))),IF(S118='Grading Scale'!E$3,'Grading Scale'!F$3,IF(S118='Grading Scale'!E$5,'Grading Scale'!F$5,IF(S118='Grading Scale'!E$7,'Grading Scale'!F$7,IF(S118='Grading Scale'!E$9,'Grading Scale'!F$9,IF(S118='Grading Scale'!E$11,'Grading Scale'!F$11,'Grading Scale'!F$13))))))","v":"B    "}," ",null,""]
[{"$f":"Scores!A110","v":0},{"$f":"Scores!B110","v":0},{"$f":"Scores!C110","v":0},{"$f":"Scores!D110","v":0},{"$f":"Scores!E110","v":0},{"$f":"Scores!F110","v":0},{"$f":"Scores!G110","v":0},{"$f":"Scores!H110","v":0},{"$f":"Scores!I110","v":0},{"$f":"Scores!J110","v":0},{"$f":"Scores!K110","v":0},{"$f":"Scores!L110","v":0},{"$f":"Scores!M110","v":0},{"$f":"Scores!N110","v":0},{"$f":"Scores!O110","v":0},-0.70710678118654746,2.9512994231491119,2.9512994231491119,{"$f":"IF(R119<'Grading Scale'!G$8,IF(R119<'Grading Scale'!G$13,'Grading Scale'!E$13,IF(R119<'Grading Scale'!G$12,'Grading Scale'!E$11,IF(R119<'Grading Scale'!G$11,'Grading Scale'!E$9,IF(R119<'Grading Scale'!G$10,'Grading Scale'!E$7,IF(R119<'Grading Scale'!G$9,'Grading Scale'!E$5,'Grading Scale'!E$3))))),IF(R119<'Grading Scale'!G$7,'Grading Scale'!B$13,IF(R119<'Grading Scale'!G$6,'Grading Scale'!B$11,IF(R119<'Grading Scale'!G$5,'Grading Scale'!B$9,IF(R119<'Grading Scale'!G$4,'Grading Scale'!B$7,IF(R119<'Grading Scale'!G$3,'Grading Scale'!B$5,'Grading Scale'!B$3))))))","v":3},{"$f":"Scores!B110","v":0},{"$f":"IF(S119>='Grading Scale'!B$13,IF(S119='Grading Scale'!B$3,'Grading Scale'!C$3,IF(S119='Grading Scale'!B$5,'Grading Scale'!C$5,IF(S119='Grading Scale'!B$7,'Grading Scale'!C$7,IF(S119='Grading Scale'!B$9,'Grading Scale'!C$9,IF(S119='Grading Scale'!B$11,'Grading Scale'!C$11,'Grading Scale'!C$13))))),IF(S119='Grading Scale'!E$3,'Grading Scale'!F$3,IF(S119='Grading Scale'!E$5,'Grading Scale'!F$5,IF(S119='Grading Scale'!E$7,'Grading Scale'!F$7,IF(S119='Grading Scale'!E$9,'Grading Scale'!F$9,IF(S119='Grading Scale'!E$11,'Grading Scale'!F$11,'Grading Scale'!F$13))))))","v":"B    "}," ",null,""]
[{"$f":"Scores!A111","v":0},{"$f":"Scores!B111","v":0},{"$f":"Scores!C111","v":0},{"$f":"Scores!D111","v":0},{"$f":"Scores!E111","v":0},{"$f":"Scores!F111","v":0},{"$f":"Scores!G111","v":0},{"$f":"Scores!H111","v":0},{"$f":"Scores!I111","v":0},{"$f":"Scores!J111","v":0},{"$f":"Scores!K111","v":0},{"$f":"Scores!L111","v":0},{"$f":"Scores!M111","v":0},{"$f":"Scores!N111","v":0},{"$f":"Scores!O111","v":0},-0.70710678118654746,2.9512994231491119,2.9512994231491119,{"$f":"IF(R120<'Grading Scale'!G$8,IF(R120<'Grading Scale'!G$13,'Grading Scale'!E$13,IF(R120<'Grading Scale'!G$12,'Grading Scale'!E$11,IF(R120<'Grading Scale'!G$11,'Grading Scale'!E$9,IF(R120<'Grading Scale'!G$10,'Grading Scale'!E$7,IF(R120<'Grading Scale'!G$9,'Grading Scale'!E$5,'Grading Scale'!E$3))))),IF(R120<'Grading Scale'!G$7,'Grading Scale'!B$13,IF(R120<'Grading Scale'!G$6,'Grading Scale'!B$11,IF(R120<'Grading Scale'!G$5,'Grading Scale'!B$9,IF(R120<'Grading Scale'!G$4,'Grading Scale'!B$7,IF(R120<'Grading Scale'!G$3,'Grading Scale'!B$5,'Grading Scale'!B$3))))))","v":3},{"$f":"Scores!B111","v":0},{"$f":"IF(S120>='Grading Scale'!B$13,IF(S120='Grading Scale'!B$3,'Grading Scale'!C$3,IF(S120='Grading Scale'!B$5,'Grading Scale'!C$5,IF(S120='Grading Scale'!B$7,'Grading Scale'!C$7,IF(S120='Grading Scale'!B$9,'Grading Scale'!C$9,IF(S120='Grading Scale'!B$11,'Grading Scale'!C$11,'Grading Scale'!C$13))))),IF(S120='Grading Scale'!E$3,'Grading Scale'!F$3,IF(S120='Grading Scale'!E$5,'Grading Scale'!F$5,IF(S120='Grading Scale'!E$7,'Grading Scale'!F$7,IF(S120='Grading Scale'!E$9,'Grading Scale'!F$9,IF(S120='Grading Scale'!E$11,'Grading Scale'!F$11,'Grading Scale'!F$13))))))","v":"B    "}," ",null,""]
[{"$f":"Scores!A112","v":0},{"$f":"Scores!B112","v":0},{"$f":"Scores!C112","v":0},{"$f":"Scores!D112","v":0},{"$f":"Scores!E112","v":0},{"$f":"Scores!F112","v":0},{"$f":"Scores!G112","v":0},{"$f":"Scores!H112","v":0},{"$f":"Scores!I112","v":0},{"$f":"Scores!J112","v":0},{"$f":"Scores!K112","v":0},{"$f":"Scores!L112","v":0},{"$f":"Scores!M112","v":0},{"$f":"Scores!N112","v":0},{"$f":"Scores!O112","v":0},-0.70710678118654746,2.9512994231491119,2.9512994231491119,{"$f":"IF(R121<'Grading Scale'!G$8,IF(R121<'Grading Scale'!G$13,'Grading Scale'!E$13,IF(R121<'Grading Scale'!G$12,'Grading Scale'!E$11,IF(R121<'Grading Scale'!G$11,'Grading Scale'!E$9,IF(R121<'Grading Scale'!G$10,'Grading Scale'!E$7,IF(R121<'Grading Scale'!G$9,'Grading Scale'!E$5,'Grading Scale'!E$3))))),IF(R121<'Grading Scale'!G$7,'Grading Scale'!B$13,IF(R121<'Grading Scale'!G$6,'Grading Scale'!B$11,IF(R121<'Grading Scale'!G$5,'Grading Scale'!B$9,IF(R121<'Grading Scale'!G$4,'Grading Scale'!B$7,IF(R121<'Grading Scale'!G$3,'Grading Scale'!B$5,'Grading Scale'!B$3))))))","v":3},{"$f":"Scores!B112","v":0},{"$f":"IF(S121>='Grading Scale'!B$13,IF(S121='Grading Scale'!B$3,'Grading Scale'!C$3,IF(S121='Grading Scale'!B$5,'Grading Scale'!C$5,IF(S121='Grading Scale'!B$7,'Grading Scale'!C$7,IF(S121='Grading Scale'!B$9,'Grading Scale'!C$9,IF(S121='Grading Scale'!B$11,'Grading Scale'!C$11,'Grading Scale'!C$13))))),IF(S121='Grading Scale'!E$3,'Grading Scale'!F$3,IF(S121='Grading Scale'!E$5,'Grading Scale'!F$5,IF(S121='Grading Scale'!E$7,'Grading Scale'!F$7,IF(S121='Grading Scale'!E$9,'Grading Scale'!F$9,IF(S121='Grading Scale'!E$11,'Grading Scale'!F$11,'Grading Scale'!F$13))))))","v":"B    "}," ",null,""]
[{"$f":"Scores!A113","v":0},{"$f":"Scores!B113","v":0},{"$f":"Scores!C113","v":0},{"$f":"Scores!D113","v":0},{"$f":"Scores!E113","v":0},{"$f":"Scores!F113","v":0},{"$f":"Scores!G113","v":0},{"$f":"Scores!H113","v":0},{"$f":"Scores!I113","v":0},{"$f":"Scores!J113","v":0},{"$f":"Scores!K113","v":0},{"$f":"Scores!L113","v":0},{"$f":"Scores!M113","v":0},{"$f":"Scores!N113","v":0},{"$f":"Scores!O113","v":0},-0.70710678118654746,2.9512994231491119,2.9512994231491119,{"$f":"IF(R122<'Grading Scale'!G$8,IF(R122<'Grading Scale'!G$13,'Grading Scale'!E$13,IF(R122<'Grading Scale'!G$12,'Grading Scale'!E$11,IF(R122<'Grading Scale'!G$11,'Grading Scale'!E$9,IF(R122<'Grading Scale'!G$10,'Grading Scale'!E$7,IF(R122<'Grading Scale'!G$9,'Grading Scale'!E$5,'Grading Scale'!E$3))))),IF(R122<'Grading Scale'!G$7,'Grading Scale'!B$13,IF(R122<'Grading Scale'!G$6,'Grading Scale'!B$11,IF(R122<'Grading Scale'!G$5,'Grading Scale'!B$9,IF(R122<'Grading Scale'!G$4,'Grading Scale'!B$7,IF(R122<'Grading Scale'!G$3,'Grading Scale'!B$5,'Grading Scale'!B$3))))))","v":3},{"$f":"Scores!B113","v":0},{"$f":"IF(S122>='Grading Scale'!B$13,IF(S122='Grading Scale'!B$3,'Grading Scale'!C$3,IF(S122='Grading Scale'!B$5,'Grading Scale'!C$5,IF(S122='Grading Scale'!B$7,'Grading Scale'!C$7,IF(S122='Grading Scale'!B$9,'Grading Scale'!C$9,IF(S122='Grading Scale'!B$11,'Grading Scale'!C$11,'Grading Scale'!C$13))))),IF(S122='Grading Scale'!E$3,'Grading Scale'!F$3,IF(S122='Grading Scale'!E$5,'Grading Scale'!F$5,IF(S122='Grading Scale'!E$7,'Grading Scale'!F$7,IF(S122='Grading Scale'!E$9,'Grading Scale'!F$9,IF(S122='Grading Scale'!E$11,'Grading Scale'!F$11,'Grading Scale'!F$13))))))","v":"B    "}," ",null,""]
[{"$f":"Scores!A114","v":0},{"$f":"Scores!B114","v":0},{"$f":"Scores!C114","v":0},{"$f":"Scores!D114","v":0},{"$f":"Scores!E114","v":0},{"$f":"Scores!F114","v":0},{"$f":"Scores!G114","v":0},{"$f":"Scores!H114","v":0},{"$f":"Scores!I114","v":0},{"$f":"Scores!J114","v":0},{"$f":"Scores!K114","v":0},{"$f":"Scores!L114","v":0},{"$f":"Scores!M114","v":0},{"$f":"Scores!N114","v":0},{"$f":"Scores!O114","v":0},-0.70710678118654746,2.9512994231491119,2.9512994231491119,{"$f":"IF(R123<'Grading Scale'!G$8,IF(R123<'Grading Scale'!G$13,'Grading Scale'!E$13,IF(R123<'Grading Scale'!G$12,'Grading Scale'!E$11,IF(R123<'Grading Scale'!G$11,'Grading Scale'!E$9,IF(R123<'Grading Scale'!G$10,'Grading Scale'!E$7,IF(R123<'Grading Scale'!G$9,'Grading Scale'!E$5,'Grading Scale'!E$3))))),IF(R123<'Grading Scale'!G$7,'Grading Scale'!B$13,IF(R123<'Grading Scale'!G$6,'Grading Scale'!B$11,IF(R123<'Grading Scale'!G$5,'Grading Scale'!B$9,IF(R123<'Grading Scale'!G$4,'Grading Scale'!B$7,IF(R123<'Grading Scale'!G$3,'Grading Scale'!B$5,'Grading Scale'!B$3))))))","v":3},{"$f":"Scores!B114","v":0},{"$f":"IF(S123>='Grading Scale'!B$13,IF(S123='Grading Scale'!B$3,'Grading Scale'!C$3,IF(S123='Grading Scale'!B$5,'Grading Scale'!C$5,IF(S123='Grading Scale'!B$7,'Grading Scale'!C$7,IF(S123='Grading Scale'!B$9,'Grading Scale'!C$9,IF(S123='Grading Scale'!B$11,'Grading Scale'!C$11,'Grading Scale'!C$13))))),IF(S123='Grading Scale'!E$3,'Grading Scale'!F$3,IF(S123='Grading Scale'!E$5,'Grading Scale'!F$5,IF(S123='Grading Scale'!E$7,'Grading Scale'!F$7,IF(S123='Grading Scale'!E$9,'Grading Scale'!F$9,IF(S123='Grading Scale'!E$11,'Grading Scale'!F$11,'Grading Scale'!F$13))))))","v":"B    "}," ",null,""]
[{"$f":"Scores!A115","v":0},{"$f":"Scores!B115","v":0},{"$f":"Scores!C115","v":0},{"$f":"Scores!D115","v":0},{"$f":"Scores!E115","v":0},{"$f":"Scores!F115","v":0},{"$f":"Scores!G115","v":0},{"$f":"Scores!H115","v":0},{"$f":"Scores!I115","v":0},{"$f":"Scores!J115","v":0},{"$f":"Scores!K115","v":0},{"$f":"Scores!L115","v":0},{"$f":"Scores!M115","v":0},{"$f":"Scores!N115","v":0},{"$f":"Scores!O115","v":0},-0.70710678118654746,2.9512994231491119,2.9512994231491119,{"$f":"IF(R124<'Grading Scale'!G$8,IF(R124<'Grading Scale'!G$13,'Grading Scale'!E$13,IF(R124<'Grading Scale'!G$12,'Grading Scale'!E$11,IF(R124<'Grading Scale'!G$11,'Grading Scale'!E$9,IF(R124<'Grading Scale'!G$10,'Grading Scale'!E$7,IF(R124<'Grading Scale'!G$9,'Grading Scale'!E$5,'Grading Scale'!E$3))))),IF(R124<'Grading Scale'!G$7,'Grading Scale'!B$13,IF(R124<'Grading Scale'!G$6,'Grading Scale'!B$11,IF(R124<'Grading Scale'!G$5,'Grading Scale'!B$9,IF(R124<'Grading Scale'!G$4,'Grading Scale'!B$7,IF(R124<'Grading Scale'!G$3,'Grading Scale'!B$5,'Grading Scale'!B$3))))))","v":3},{"$f":"Scores!B115","v":0},{"$f":"IF(S124>='Grading Scale'!B$13,IF(S124='Grading Scale'!B$3,'Grading Scale'!C$3,IF(S124='Grading Scale'!B$5,'Grading Scale'!C$5,IF(S124='Grading Scale'!B$7,'Grading Scale'!C$7,IF(S124='Grading Scale'!B$9,'Grading Scale'!C$9,IF(S124='Grading Scale'!B$11,'Grading Scale'!C$11,'Grading Scale'!C$13))))),IF(S124='Grading Scale'!E$3,'Grading Scale'!F$3,IF(S124='Grading Scale'!E$5,'Grading Scale'!F$5,IF(S124='Grading Scale'!E$7,'Grading Scale'!F$7,IF(S124='Grading Scale'!E$9,'Grading Scale'!F$9,IF(S124='Grading Scale'!E$11,'Grading Scale'!F$11,'Grading Scale'!F$13))))))","v":"B    "}," ",null,""]
[{"$f":"Scores!A116","v":0},{"$f":"Scores!B116","v":0},{"$f":"Scores!C116","v":0},{"$f":"Scores!D116","v":0},{"$f":"Scores!E116","v":0},{"$f":"Scores!F116","v":0},{"$f":"Scores!G116","v":0},{"$f":"Scores!H116","v":0},{"$f":"Scores!I116","v":0},{"$f":"Scores!J116","v":0},{"$f":"Scores!K116","v":0},{"$f":"Scores!L116","v":0},{"$f":"Scores!M116","v":0},{"$f":"Scores!N116","v":0},{"$f":"Scores!O116","v":0},-0.70710678118654746,2.9512994231491119,2.9512994231491119,{"$f":"IF(R125<'Grading Scale'!G$8,IF(R125<'Grading Scale'!G$13,'Grading Scale'!E$13,IF(R125<'Grading Scale'!G$12,'Grading Scale'!E$11,IF(R125<'Grading Scale'!G$11,'Grading Scale'!E$9,IF(R125<'Grading Scale'!G$10,'Grading Scale'!E$7,IF(R125<'Grading Scale'!G$9,'Grading Scale'!E$5,'Grading Scale'!E$3))))),IF(R125<'Grading Scale'!G$7,'Grading Scale'!B$13,IF(R125<'Grading Scale'!G$6,'Grading Scale'!B$11,IF(R125<'Grading Scale'!G$5,'Grading Scale'!B$9,IF(R125<'Grading Scale'!G$4,'Grading Scale'!B$7,IF(R125<'Grading Scale'!G$3,'Grading Scale'!B$5,'Grading Scale'!B$3))))))","v":3},{"$f":"Scores!B116","v":0},{"$f":"IF(S125>='Grading Scale'!B$13,IF(S125='Grading Scale'!B$3,'Grading Scale'!C$3,IF(S125='Grading Scale'!B$5,'Grading Scale'!C$5,IF(S125='Grading Scale'!B$7,'Grading Scale'!C$7,IF(S125='Grading Scale'!B$9,'Grading Scale'!C$9,IF(S125='Grading Scale'!B$11,'Grading Scale'!C$11,'Grading Scale'!C$13))))),IF(S125='Grading Scale'!E$3,'Grading Scale'!F$3,IF(S125='Grading Scale'!E$5,'Grading Scale'!F$5,IF(S125='Grading Scale'!E$7,'Grading Scale'!F$7,IF(S125='Grading Scale'!E$9,'Grading Scale'!F$9,IF(S125='Grading Scale'!E$11,'Grading Scale'!F$11,'Grading Scale'!F$13))))))","v":"B    "}," ",null,""]
[{"$f":"Scores!A117","v":0},{"$f":"Scores!B117","v":0},{"$f":"Scores!C117","v":0},{"$f":"Scores!D117","v":0},{"$f":"Scores!E117","v":0},{"$f":"Scores!F117","v":0},{"$f":"Scores!G117","v":0},{"$f":"Scores!H117","v":0},{"$f":"Scores!I117","v":0},{"$f":"Scores!J117","v":0},{"$f":"Scores!K117","v":0},{"$f":"Scores!L117","v":0},{"$f":"Scores!M117","v":0},{"$f":"Scores!N117","v":0},{"$f":"Scores!O117","v":0},-0.70710678118654746,2.9512994231491119,2.9512994231491119,{"$f":"IF(R126<'Grading Scale'!G$8,IF(R126<'Grading Scale'!G$13,'Grading Scale'!E$13,IF(R126<'Grading Scale'!G$12,'Grading Scale'!E$11,IF(R126<'Grading Scale'!G$11,'Grading Scale'!E$9,IF(R126<'Grading Scale'!G$10,'Grading Scale'!E$7,IF(R126<'Grading Scale'!G$9,'Grading Scale'!E$5,'Grading Scale'!E$3))))),IF(R126<'Grading Scale'!G$7,'Grading Scale'!B$13,IF(R126<'Grading Scale'!G$6,'Grading Scale'!B$11,IF(R126<'Grading Scale'!G$5,'Grading Scale'!B$9,IF(R126<'Grading Scale'!G$4,'Grading Scale'!B$7,IF(R126<'Grading Scale'!G$3,'Grading Scale'!B$5,'Grading Scale'!B$3))))))","v":3},{"$f":"Scores!B117","v":0},{"$f":"IF(S126>='Grading Scale'!B$13,IF(S126='Grading Scale'!B$3,'Grading Scale'!C$3,IF(S126='Grading Scale'!B$5,'Grading Scale'!C$5,IF(S126='Grading Scale'!B$7,'Grading Scale'!C$7,IF(S126='Grading Scale'!B$9,'Grading Scale'!C$9,IF(S126='Grading Scale'!B$11,'Grading Scale'!C$11,'Grading Scale'!C$13))))),IF(S126='Grading Scale'!E$3,'Grading Scale'!F$3,IF(S126='Grading Scale'!E$5,'Grading Scale'!F$5,IF(S126='Grading Scale'!E$7,'Grading Scale'!F$7,IF(S126='Grading Scale'!E$9,'Grading Scale'!F$9,IF(S126='Grading Scale'!E$11,'Grading Scale'!F$11,'Grading Scale'!F$13))))))","v":"B    "}," ",null,""]
[{"$f":"Scores!A118","v":0},{"$f":"Scores!B118","v":0},{"$f":"Scores!C118","v":0},{"$f":"Scores!D118","v":0},{"$f":"Scores!E118","v":0},{"$f":"Scores!F118","v":0},{"$f":"Scores!G118","v":0},{"$f":"Scores!H118","v":0},{"$f":"Scores!I118","v":0},{"$f":"Scores!J118","v":0},{"$f":"Scores!K118","v":0},{"$f":"Scores!L118","v":0},{"$f":"Scores!M118","v":0},{"$f":"Scores!N118","v":0},{"$f":"Scores!O118","v":0},-0.70710678118654746,2.9512994231491119,2.9512994231491119,{"$f":"IF(R127<'Grading Scale'!G$8,IF(R127<'Grading Scale'!G$13,'Grading Scale'!E$13,IF(R127<'Grading Scale'!G$12,'Grading Scale'!E$11,IF(R127<'Grading Scale'!G$11,'Grading Scale'!E$9,IF(R127<'Grading Scale'!G$10,'Grading Scale'!E$7,IF(R127<'Grading Scale'!G$9,'Grading Scale'!E$5,'Grading Scale'!E$3))))),IF(R127<'Grading Scale'!G$7,'Grading Scale'!B$13,IF(R127<'Grading Scale'!G$6,'Grading Scale'!B$11,IF(R127<'Grading Scale'!G$5,'Grading Scale'!B$9,IF(R127<'Grading Scale'!G$4,'Grading Scale'!B$7,IF(R127<'Grading Scale'!G$3,'Grading Scale'!B$5,'Grading Scale'!B$3))))))","v":3},{"$f":"Scores!B118","v":0},{"$f":"IF(S127>='Grading Scale'!B$13,IF(S127='Grading Scale'!B$3,'Grading Scale'!C$3,IF(S127='Grading Scale'!B$5,'Grading Scale'!C$5,IF(S127='Grading Scale'!B$7,'Grading Scale'!C$7,IF(S127='Grading Scale'!B$9,'Grading Scale'!C$9,IF(S127='Grading Scale'!B$11,'Grading Scale'!C$11,'Grading Scale'!C$13))))),IF(S127='Grading Scale'!E$3,'Grading Scale'!F$3,IF(S127='Grading Scale'!E$5,'Grading Scale'!F$5,IF(S127='Grading Scale'!E$7,'Grading Scale'!F$7,IF(S127='Grading Scale'!E$9,'Grading Scale'!F$9,IF(S127='Grading Scale'!E$11,'Grading Scale'!F$11,'Grading Scale'!F$13))))))","v":"B    "}," ",null,""]
[{"$f":"Scores!A119","v":0},{"$f":"Scores!B119","v":0},{"$f":"Scores!C119","v":0},{"$f":"Scores!D119","v":0},{"$f":"Scores!E119","v":0},{"$f":"Scores!F119","v":0},{"$f":"Scores!G119","v":0},{"$f":"Scores!H119","v":0},{"$f":"Scores!I119","v":0},{"$f":"Scores!J119","v":0},{"$f":"Scores!K119","v":0},{"$f":"Scores!L119","v":0},{"$f":"Scores!M119","v":0},{"$f":"Scores!N119","v":0},{"$f":"Scores!O119","v":0},-0.70710678118654746,2.9512994231491119,2.9512994231491119,{"$f":"IF(R128<'Grading Scale'!G$8,IF(R128<'Grading Scale'!G$13,'Grading Scale'!E$13,IF(R128<'Grading Scale'!G$12,'Grading Scale'!E$11,IF(R128<'Grading Scale'!G$11,'Grading Scale'!E$9,IF(R128<'Grading Scale'!G$10,'Grading Scale'!E$7,IF(R128<'Grading Scale'!G$9,'Grading Scale'!E$5,'Grading Scale'!E$3))))),IF(R128<'Grading Scale'!G$7,'Grading Scale'!B$13,IF(R128<'Grading Scale'!G$6,'Grading Scale'!B$11,IF(R128<'Grading Scale'!G$5,'Grading Scale'!B$9,IF(R128<'Grading Scale'!G$4,'Grading Scale'!B$7,IF(R128<'Grading Scale'!G$3,'Grading Scale'!B$5,'Grading Scale'!B$3))))))","v":3},{"$f":"Scores!B119","v":0},{"$f":"IF(S128>='Grading Scale'!B$13,IF(S128='Grading Scale'!B$3,'Grading Scale'!C$3,IF(S128='Grading Scale'!B$5,'Grading Scale'!C$5,IF(S128='Grading Scale'!B$7,'Grading Scale'!C$7,IF(S128='Grading Scale'!B$9,'Grading Scale'!C$9,IF(S128='Grading Scale'!B$11,'Grading Scale'!C$11,'Grading Scale'!C$13))))),IF(S128='Grading Scale'!E$3,'Grading Scale'!F$3,IF(S128='Grading Scale'!E$5,'Grading Scale'!F$5,IF(S128='Grading Scale'!E$7,'Grading Scale'!F$7,IF(S128='Grading Scale'!E$9,'Grading Scale'!F$9,IF(S128='Grading Scale'!E$11,'Grading Scale'!F$11,'Grading Scale'!F$13))))))","v":"B    "}," ",null,""]
[{"$f":"Scores!A120","v":0},{"$f":"Scores!B120","v":0},{"$f":"Scores!C120","v":0},{"$f":"Scores!D120","v":0},{"$f":"Scores!E120","v":0},{"$f":"Scores!F120","v":0},{"$f":"Scores!G120","v":0},{"$f":"Scores!H120","v":0},{"$f":"Scores!I120","v":0},{"$f":"Scores!J120","v":0},{"$f":"Scores!K120","v":0},{"$f":"Scores!L120","v":0},{"$f":"Scores!M120","v":0},{"$f":"Scores!N120","v":0},{"$f":"Scores!O120","v":0},-0.70710678118654746,2.9512994231491119,2.9512994231491119,{"$f":"IF(R129<'Grading Scale'!G$8,IF(R129<'Grading Scale'!G$13,'Grading Scale'!E$13,IF(R129<'Grading Scale'!G$12,'Grading Scale'!E$11,IF(R129<'Grading Scale'!G$11,'Grading Scale'!E$9,IF(R129<'Grading Scale'!G$10,'Grading Scale'!E$7,IF(R129<'Grading Scale'!G$9,'Grading Scale'!E$5,'Grading Scale'!E$3))))),IF(R129<'Grading Scale'!G$7,'Grading Scale'!B$13,IF(R129<'Grading Scale'!G$6,'Grading Scale'!B$11,IF(R129<'Grading Scale'!G$5,'Grading Scale'!B$9,IF(R129<'Grading Scale'!G$4,'Grading Scale'!B$7,IF(R129<'Grading Scale'!G$3,'Grading Scale'!B$5,'Grading Scale'!B$3))))))","v":3},{"$f":"Scores!B120","v":0},{"$f":"IF(S129>='Grading Scale'!B$13,IF(S129='Grading Scale'!B$3,'Grading Scale'!C$3,IF(S129='Grading Scale'!B$5,'Grading Scale'!C$5,IF(S129='Grading Scale'!B$7,'Grading Scale'!C$7,IF(S129='Grading Scale'!B$9,'Grading Scale'!C$9,IF(S129='Grading Scale'!B$11,'Grading Scale'!C$11,'Grading Scale'!C$13))))),IF(S129='Grading Scale'!E$3,'Grading Scale'!F$3,IF(S129='Grading Scale'!E$5,'Grading Scale'!F$5,IF(S129='Grading Scale'!E$7,'Grading Scale'!F$7,IF(S129='Grading Scale'!E$9,'Grading Scale'!F$9,IF(S129='Grading Scale'!E$11,'Grading Scale'!F$11,'Grading Scale'!F$13))))))","v":"B    "}," ",null,""]
[{"$f":"Scores!A121","v":0},{"$f":"Scores!B121","v":0},{"$f":"Scores!C121","v":0},{"$f":"Scores!D121","v":0},{"$f":"Scores!E121","v":0},{"$f":"Scores!F121","v":0},{"$f":"Scores!G121","v":0},{"$f":"Scores!H121","v":0},{"$f":"Scores!I121","v":0},{"$f":"Scores!J121","v":0},{"$f":"Scores!K121","v":0},{"$f":"Scores!L121","v":0},{"$f":"Scores!M121","v":0},{"$f":"Scores!N121","v":0},{"$f":"Scores!O121","v":0},-0.70710678118654746,2.9512994231491119,2.9512994231491119,{"$f":"IF(R130<'Grading Scale'!G$8,IF(R130<'Grading Scale'!G$13,'Grading Scale'!E$13,IF(R130<'Grading Scale'!G$12,'Grading Scale'!E$11,IF(R130<'Grading Scale'!G$11,'Grading Scale'!E$9,IF(R130<'Grading Scale'!G$10,'Grading Scale'!E$7,IF(R130<'Grading Scale'!G$9,'Grading Scale'!E$5,'Grading Scale'!E$3))))),IF(R130<'Grading Scale'!G$7,'Grading Scale'!B$13,IF(R130<'Grading Scale'!G$6,'Grading Scale'!B$11,IF(R130<'Grading Scale'!G$5,'Grading Scale'!B$9,IF(R130<'Grading Scale'!G$4,'Grading Scale'!B$7,IF(R130<'Grading Scale'!G$3,'Grading Scale'!B$5,'Grading Scale'!B$3))))))","v":3},{"$f":"Scores!B121","v":0},{"$f":"IF(S130>='Grading Scale'!B$13,IF(S130='Grading Scale'!B$3,'Grading Scale'!C$3,IF(S130='Grading Scale'!B$5,'Grading Scale'!C$5,IF(S130='Grading Scale'!B$7,'Grading Scale'!C$7,IF(S130='Grading Scale'!B$9,'Grading Scale'!C$9,IF(S130='Grading Scale'!B$11,'Grading Scale'!C$11,'Grading Scale'!C$13))))),IF(S130='Grading Scale'!E$3,'Grading Scale'!F$3,IF(S130='Grading Scale'!E$5,'Grading Scale'!F$5,IF(S130='Grading Scale'!E$7,'Grading Scale'!F$7,IF(S130='Grading Scale'!E$9,'Grading Scale'!F$9,IF(S130='Grading Scale'!E$11,'Grading Scale'!F$11,'Grading Scale'!F$13))))))","v":"B    "}," ",null,""]
[{"$f":"Scores!A122","v":0},{"$f":"Scores!B122","v":0},{"$f":"Scores!C122","v":0},{"$f":"Scores!D122","v":0},{"$f":"Scores!E122","v":0},{"$f":"Scores!F122","v":0},{"$f":"Scores!G122","v":0},{"$f":"Scores!H122","v":0},{"$f":"Scores!I122","v":0},{"$f":"Scores!J122","v":0},{"$f":"Scores!K122","v":0},{"$f":"Scores!L122","v":0},{"$f":"Scores!M122","v":0},{"$f":"Scores!N122","v":0},{"$f":"Scores!O122","v":0},-0.70710678118654746,2.9512994231491119,2.9512994231491119,{"$f":"IF(R131<'Grading Scale'!G$8,IF(R131<'Grading Scale'!G$13,'Grading Scale'!E$13,IF(R131<'Grading Scale'!G$12,'Grading Scale'!E$11,IF(R131<'Grading Scale'!G$11,'Grading Scale'!E$9,IF(R131<'Grading Scale'!G$10,'Grading Scale'!E$7,IF(R131<'Grading Scale'!G$9,'Grading Scale'!E$5,'Grading Scale'!E$3))))),IF(R131<'Grading Scale'!G$7,'Grading Scale'!B$13,IF(R131<'Grading Scale'!G$6,'Grading Scale'!B$11,IF(R131<'Grading Scale'!G$5,'Grading Scale'!B$9,IF(R131<'Grading Scale'!G$4,'Grading Scale'!B$7,IF(R131<'Grading Scale'!G$3,'Grading Scale'!B$5,'Grading Scale'!B$3))))))","v":3},{"$f":"Scores!B122","v":0},{"$f":"IF(S131>='Grading Scale'!B$13,IF(S131='Grading Scale'!B$3,'Grading Scale'!C$3,IF(S131='Grading Scale'!B$5,'Grading Scale'!C$5,IF(S131='Grading Scale'!B$7,'Grading Scale'!C$7,IF(S131='Grading Scale'!B$9,'Grading Scale'!C$9,IF(S131='Grading Scale'!B$11,'Grading Scale'!C$11,'Grading Scale'!C$13))))),IF(S131='Grading Scale'!E$3,'Grading Scale'!F$3,IF(S131='Grading Scale'!E$5,'Grading Scale'!F$5,IF(S131='Grading Scale'!E$7,'Grading Scale'!F$7,IF(S131='Grading Scale'!E$9,'Grading Scale'!F$9,IF(S131='Grading Scale'!E$11,'Grading Scale'!F$11,'Grading Scale'!F$13))))))","v":"B    "}," ",null,""]
[{"$f":"Scores!A123","v":0},{"$f":"Scores!B123","v":0},{"$f":"Scores!C123","v":0},{"$f":"Scores!D123","v":0},{"$f":"Scores!E123","v":0},{"$f":"Scores!F123","v":0},{"$f":"Scores!G123","v":0},{"$f":"Scores!H123","v":0},{"$f":"Scores!I123","v":0},{"$f":"Scores!J123","v":0},{"$f":"Scores!K123","v":0},{"$f":"Scores!L123","v":0},{"$f":"Scores!M123","v":0},{"$f":"Scores!N123","v":0},{"$f":"Scores!O123","v":0},-0.70710678118654746,2.9512994231491119,2.9512994231491119,{"$f":"IF(R132<'Grading Scale'!G$8,IF(R132<'Grading Scale'!G$13,'Grading Scale'!E$13,IF(R132<'Grading Scale'!G$12,'Grading Scale'!E$11,IF(R132<'Grading Scale'!G$11,'Grading Scale'!E$9,IF(R132<'Grading Scale'!G$10,'Grading Scale'!E$7,IF(R132<'Grading Scale'!G$9,'Grading Scale'!E$5,'Grading Scale'!E$3))))),IF(R132<'Grading Scale'!G$7,'Grading Scale'!B$13,IF(R132<'Grading Scale'!G$6,'Grading Scale'!B$11,IF(R132<'Grading Scale'!G$5,'Grading Scale'!B$9,IF(R132<'Grading Scale'!G$4,'Grading Scale'!B$7,IF(R132<'Grading Scale'!G$3,'Grading Scale'!B$5,'Grading Scale'!B$3))))))","v":3},{"$f":"Scores!B123","v":0},{"$f":"IF(S132>='Grading Scale'!B$13,IF(S132='Grading Scale'!B$3,'Grading Scale'!C$3,IF(S132='Grading Scale'!B$5,'Grading Scale'!C$5,IF(S132='Grading Scale'!B$7,'Grading Scale'!C$7,IF(S132='Grading Scale'!B$9,'Grading Scale'!C$9,IF(S132='Grading Scale'!B$11,'Grading Scale'!C$11,'Grading Scale'!C$13))))),IF(S132='Grading Scale'!E$3,'Grading Scale'!F$3,IF(S132='Grading Scale'!E$5,'Grading Scale'!F$5,IF(S132='Grading Scale'!E$7,'Grading Scale'!F$7,IF(S132='Grading Scale'!E$9,'Grading Scale'!F$9,IF(S132='Grading Scale'!E$11,'Grading Scale'!F$11,'Grading Scale'!F$13))))))","v":"B    "}," ",null,""]
[{"$f":"Scores!A124","v":0},{"$f":"Scores!B124","v":0},{"$f":"Scores!C124","v":0},{"$f":"Scores!D124","v":0},{"$f":"Scores!E124","v":0},{"$f":"Scores!F124","v":0},{"$f":"Scores!G124","v":0},{"$f":"Scores!H124","v":0},{"$f":"Scores!I124","v":0},{"$f":"Scores!J124","v":0},{"$f":"Scores!K124","v":0},{"$f":"Scores!L124","v":0},{"$f":"Scores!M124","v":0},{"$f":"Scores!N124","v":0},{"$f":"Scores!O124","v":0},-0.70710678118654746,2.9512994231491119,2.9512994231491119,{"$f":"IF(R133<'Grading Scale'!G$8,IF(R133<'Grading Scale'!G$13,'Grading Scale'!E$13,IF(R133<'Grading Scale'!G$12,'Grading Scale'!E$11,IF(R133<'Grading Scale'!G$11,'Grading Scale'!E$9,IF(R133<'Grading Scale'!G$10,'Grading Scale'!E$7,IF(R133<'Grading Scale'!G$9,'Grading Scale'!E$5,'Grading Scale'!E$3))))),IF(R133<'Grading Scale'!G$7,'Grading Scale'!B$13,IF(R133<'Grading Scale'!G$6,'Grading Scale'!B$11,IF(R133<'Grading Scale'!G$5,'Grading Scale'!B$9,IF(R133<'Grading Scale'!G$4,'Grading Scale'!B$7,IF(R133<'Grading Scale'!G$3,'Grading Scale'!B$5,'Grading Scale'!B$3))))))","v":3},{"$f":"Scores!B124","v":0},{"$f":"IF(S133>='Grading Scale'!B$13,IF(S133='Grading Scale'!B$3,'Grading Scale'!C$3,IF(S133='Grading Scale'!B$5,'Grading Scale'!C$5,IF(S133='Grading Scale'!B$7,'Grading Scale'!C$7,IF(S133='Grading Scale'!B$9,'Grading Scale'!C$9,IF(S133='Grading Scale'!B$11,'Grading Scale'!C$11,'Grading Scale'!C$13))))),IF(S133='Grading Scale'!E$3,'Grading Scale'!F$3,IF(S133='Grading Scale'!E$5,'Grading Scale'!F$5,IF(S133='Grading Scale'!E$7,'Grading Scale'!F$7,IF(S133='Grading Scale'!E$9,'Grading Scale'!F$9,IF(S133='Grading Scale'!E$11,'Grading Scale'!F$11,'Grading Scale'!F$13))))))","v":"B    "}," ",null,""]
[{"$f":"Scores!A125","v":0},{"$f":"Scores!B125","v":0},{"$f":"Scores!C125","v":0},{"$f":"Scores!D125","v":0},{"$f":"Scores!E125","v":0},{"$f":"Scores!F125","v":0},{"$f":"Scores!G125","v":0},{"$f":"Scores!H125","v":0},{"$f":"Scores!I125","v":0},{"$f":"Scores!J125","v":0},{"$f":"Scores!K125","v":0},{"$f":"Scores!L125","v":0},{"$f":"Scores!M125","v":0},{"$f":"Scores!N125","v":0},{"$f":"Scores!O125","v":0},-0.70710678118654746,2.9512994231491119,2.9512994231491119,{"$f":"IF(R134<'Grading Scale'!G$8,IF(R134<'Grading Scale'!G$13,'Grading Scale'!E$13,IF(R134<'Grading Scale'!G$12,'Grading Scale'!E$11,IF(R134<'Grading Scale'!G$11,'Grading Scale'!E$9,IF(R134<'Grading Scale'!G$10,'Grading Scale'!E$7,IF(R134<'Grading Scale'!G$9,'Grading Scale'!E$5,'Grading Scale'!E$3))))),IF(R134<'Grading Scale'!G$7,'Grading Scale'!B$13,IF(R134<'Grading Scale'!G$6,'Grading Scale'!B$11,IF(R134<'Grading Scale'!G$5,'Grading Scale'!B$9,IF(R134<'Grading Scale'!G$4,'Grading Scale'!B$7,IF(R134<'Grading Scale'!G$3,'Grading Scale'!B$5,'Grading Scale'!B$3))))))","v":3},{"$f":"Scores!B125","v":0},{"$f":"IF(S134>='Grading Scale'!B$13,IF(S134='Grading Scale'!B$3,'Grading Scale'!C$3,IF(S134='Grading Scale'!B$5,'Grading Scale'!C$5,IF(S134='Grading Scale'!B$7,'Grading Scale'!C$7,IF(S134='Grading Scale'!B$9,'Grading Scale'!C$9,IF(S134='Grading Scale'!B$11,'Grading Scale'!C$11,'Grading Scale'!C$13))))),IF(S134='Grading Scale'!E$3,'Grading Scale'!F$3,IF(S134='Grading Scale'!E$5,'Grading Scale'!F$5,IF(S134='Grading Scale'!E$7,'Grading Scale'!F$7,IF(S134='Grading Scale'!E$9,'Grading Scale'!F$9,IF(S134='Grading Scale'!E$11,'Grading Scale'!F$11,'Grading Scale'!F$13))))))","v":"B    "}," ",null,""]
[{"$f":"Scores!A126","v":0},{"$f":"Scores!B126","v":0},{"$f":"Scores!C126","v":0},{"$f":"Scores!D126","v":0},{"$f":"Scores!E126","v":0},{"$f":"Scores!F126","v":0},{"$f":"Scores!G126","v":0},{"$f":"Scores!H126","v":0},{"$f":"Scores!I126","v":0},{"$f":"Scores!J126","v":0},{"$f":"Scores!K126","v":0},{"$f":"Scores!L126","v":0},{"$f":"Scores!M126","v":0},{"$f":"Scores!N126","v":0},{"$f":"Scores!O126","v":0},-0.70710678118654746,2.9512994231491119,2.9512994231491119,{"$f":"IF(R135<'Grading Scale'!G$8,IF(R135<'Grading Scale'!G$13,'Grading Scale'!E$13,IF(R135<'Grading Scale'!G$12,'Grading Scale'!E$11,IF(R135<'Grading Scale'!G$11,'Grading Scale'!E$9,IF(R135<'Grading Scale'!G$10,'Grading Scale'!E$7,IF(R135<'Grading Scale'!G$9,'Grading Scale'!E$5,'Grading Scale'!E$3))))),IF(R135<'Grading Scale'!G$7,'Grading Scale'!B$13,IF(R135<'Grading Scale'!G$6,'Grading Scale'!B$11,IF(R135<'Grading Scale'!G$5,'Grading Scale'!B$9,IF(R135<'Grading Scale'!G$4,'Grading Scale'!B$7,IF(R135<'Grading Scale'!G$3,'Grading Scale'!B$5,'Grading Scale'!B$3))))))","v":3},{"$f":"Scores!B126","v":0},{"$f":"IF(S135>='Grading Scale'!B$13,IF(S135='Grading Scale'!B$3,'Grading Scale'!C$3,IF(S135='Grading Scale'!B$5,'Grading Scale'!C$5,IF(S135='Grading Scale'!B$7,'Grading Scale'!C$7,IF(S135='Grading Scale'!B$9,'Grading Scale'!C$9,IF(S135='Grading Scale'!B$11,'Grading Scale'!C$11,'Grading Scale'!C$13))))),IF(S135='Grading Scale'!E$3,'Grading Scale'!F$3,IF(S135='Grading Scale'!E$5,'Grading Scale'!F$5,IF(S135='Grading Scale'!E$7,'Grading Scale'!F$7,IF(S135='Grading Scale'!E$9,'Grading Scale'!F$9,IF(S135='Grading Scale'!E$11,'Grading Scale'!F$11,'Grading Scale'!F$13))))))","v":"B    "}," ",null,""]
[{"$f":"Scores!A127","v":0},{"$f":"Scores!B127","v":0},{"$f":"Scores!C127","v":0},{"$f":"Scores!D127","v":0},{"$f":"Scores!E127","v":0},{"$f":"Scores!F127","v":0},{"$f":"Scores!G127","v":0},{"$f":"Scores!H127","v":0},{"$f":"Scores!I127","v":0},{"$f":"Scores!J127","v":0},{"$f":"Scores!K127","v":0},{"$f":"Scores!L127","v":0},{"$f":"Scores!M127","v":0},{"$f":"Scores!N127","v":0},{"$f":"Scores!O127","v":0},-0.70710678118654746,2.9512994231491119,2.9512994231491119,{"$f":"IF(R136<'Grading Scale'!G$8,IF(R136<'Grading Scale'!G$13,'Grading Scale'!E$13,IF(R136<'Grading Scale'!G$12,'Grading Scale'!E$11,IF(R136<'Grading Scale'!G$11,'Grading Scale'!E$9,IF(R136<'Grading Scale'!G$10,'Grading Scale'!E$7,IF(R136<'Grading Scale'!G$9,'Grading Scale'!E$5,'Grading Scale'!E$3))))),IF(R136<'Grading Scale'!G$7,'Grading Scale'!B$13,IF(R136<'Grading Scale'!G$6,'Grading Scale'!B$11,IF(R136<'Grading Scale'!G$5,'Grading Scale'!B$9,IF(R136<'Grading Scale'!G$4,'Grading Scale'!B$7,IF(R136<'Grading Scale'!G$3,'Grading Scale'!B$5,'Grading Scale'!B$3))))))","v":3},{"$f":"Scores!B127","v":0},{"$f":"IF(S136>='Grading Scale'!B$13,IF(S136='Grading Scale'!B$3,'Grading Scale'!C$3,IF(S136='Grading Scale'!B$5,'Grading Scale'!C$5,IF(S136='Grading Scale'!B$7,'Grading Scale'!C$7,IF(S136='Grading Scale'!B$9,'Grading Scale'!C$9,IF(S136='Grading Scale'!B$11,'Grading Scale'!C$11,'Grading Scale'!C$13))))),IF(S136='Grading Scale'!E$3,'Grading Scale'!F$3,IF(S136='Grading Scale'!E$5,'Grading Scale'!F$5,IF(S136='Grading Scale'!E$7,'Grading Scale'!F$7,IF(S136='Grading Scale'!E$9,'Grading Scale'!F$9,IF(S136='Grading Scale'!E$11,'Grading Scale'!F$11,'Grading Scale'!F$13))))))","v":"B    "}," ",null,""]
[{"$f":"Scores!A128","v":0},{"$f":"Scores!B128","v":0},{"$f":"Scores!C128","v":0},{"$f":"Scores!D128","v":0},{"$f":"Scores!E128","v":0},{"$f":"Scores!F128","v":0},{"$f":"Scores!G128","v":0},{"$f":"Scores!H128","v":0},{"$f":"Scores!I128","v":0},{"$f":"Scores!J128","v":0},{"$f":"Scores!K128","v":0},{"$f":"Scores!L128","v":0},{"$f":"Scores!M128","v":0},{"$f":"Scores!N128","v":0},{"$f":"Scores!O128","v":0},-0.70710678118654746,2.9512994231491119,2.9512994231491119,{"$f":"IF(R137<'Grading Scale'!G$8,IF(R137<'Grading Scale'!G$13,'Grading Scale'!E$13,IF(R137<'Grading Scale'!G$12,'Grading Scale'!E$11,IF(R137<'Grading Scale'!G$11,'Grading Scale'!E$9,IF(R137<'Grading Scale'!G$10,'Grading Scale'!E$7,IF(R137<'Grading Scale'!G$9,'Grading Scale'!E$5,'Grading Scale'!E$3))))),IF(R137<'Grading Scale'!G$7,'Grading Scale'!B$13,IF(R137<'Grading Scale'!G$6,'Grading Scale'!B$11,IF(R137<'Grading Scale'!G$5,'Grading Scale'!B$9,IF(R137<'Grading Scale'!G$4,'Grading Scale'!B$7,IF(R137<'Grading Scale'!G$3,'Grading Scale'!B$5,'Grading Scale'!B$3))))))","v":3},{"$f":"Scores!B128","v":0},{"$f":"IF(S137>='Grading Scale'!B$13,IF(S137='Grading Scale'!B$3,'Grading Scale'!C$3,IF(S137='Grading Scale'!B$5,'Grading Scale'!C$5,IF(S137='Grading Scale'!B$7,'Grading Scale'!C$7,IF(S137='Grading Scale'!B$9,'Grading Scale'!C$9,IF(S137='Grading Scale'!B$11,'Grading Scale'!C$11,'Grading Scale'!C$13))))),IF(S137='Grading Scale'!E$3,'Grading Scale'!F$3,IF(S137='Grading Scale'!E$5,'Grading Scale'!F$5,IF(S137='Grading Scale'!E$7,'Grading Scale'!F$7,IF(S137='Grading Scale'!E$9,'Grading Scale'!F$9,IF(S137='Grading Scale'!E$11,'Grading Scale'!F$11,'Grading Scale'!F$13))))))","v":"B    "}," ",null,""]
[{"$f":"Scores!A129","v":0},{"$f":"Scores!B129","v":0},{"$f":"Scores!C129","v":0},{"$f":"Scores!D129","v":0},{"$f":"Scores!E129","v":0},{"$f":"Scores!F129","v":0},{"$f":"Scores!G129","v":0},{"$f":"Scores!H129","v":0},{"$f":"Scores!I129","v":0},{"$f":"Scores!J129","v":0},{"$f":"Scores!K129","v":0},{"$f":"Scores!L129","v":0},{"$f":"Scores!M129","v":0},{"$f":"Scores!N129","v":0},{"$f":"Scores!O129","v":0},-0.70710678118654746,2.9512994231491119,2.9512994231491119,{"$f":"IF(R138<'Grading Scale'!G$8,IF(R138<'Grading Scale'!G$13,'Grading Scale'!E$13,IF(R138<'Grading Scale'!G$12,'Grading Scale'!E$11,IF(R138<'Grading Scale'!G$11,'Grading Scale'!E$9,IF(R138<'Grading Scale'!G$10,'Grading Scale'!E$7,IF(R138<'Grading Scale'!G$9,'Grading Scale'!E$5,'Grading Scale'!E$3))))),IF(R138<'Grading Scale'!G$7,'Grading Scale'!B$13,IF(R138<'Grading Scale'!G$6,'Grading Scale'!B$11,IF(R138<'Grading Scale'!G$5,'Grading Scale'!B$9,IF(R138<'Grading Scale'!G$4,'Grading Scale'!B$7,IF(R138<'Grading Scale'!G$3,'Grading Scale'!B$5,'Grading Scale'!B$3))))))","v":3},{"$f":"Scores!B129","v":0},{"$f":"IF(S138>='Grading Scale'!B$13,IF(S138='Grading Scale'!B$3,'Grading Scale'!C$3,IF(S138='Grading Scale'!B$5,'Grading Scale'!C$5,IF(S138='Grading Scale'!B$7,'Grading Scale'!C$7,IF(S138='Grading Scale'!B$9,'Grading Scale'!C$9,IF(S138='Grading Scale'!B$11,'Grading Scale'!C$11,'Grading Scale'!C$13))))),IF(S138='Grading Scale'!E$3,'Grading Scale'!F$3,IF(S138='Grading Scale'!E$5,'Grading Scale'!F$5,IF(S138='Grading Scale'!E$7,'Grading Scale'!F$7,IF(S138='Grading Scale'!E$9,'Grading Scale'!F$9,IF(S138='Grading Scale'!E$11,'Grading Scale'!F$11,'Grading Scale'!F$13))))))","v":"B    "}," ",null,""]
[{"$f":"Scores!A130","v":0},{"$f":"Scores!B130","v":0},{"$f":"Scores!C130","v":0},{"$f":"Scores!D130","v":0},{"$f":"Scores!E130","v":0},{"$f":"Scores!F130","v":0},{"$f":"Scores!G130","v":0},{"$f":"Scores!H130","v":0},{"$f":"Scores!I130","v":0},{"$f":"Scores!J130","v":0},{"$f":"Scores!K130","v":0},{"$f":"Scores!L130","v":0},{"$f":"Scores!M130","v":0},{"$f":"Scores!N130","v":0},{"$f":"Scores!O130","v":0},-0.70710678118654746,2.9512994231491119,2.9512994231491119,{"$f":"IF(R139<'Grading Scale'!G$8,IF(R139<'Grading Scale'!G$13,'Grading Scale'!E$13,IF(R139<'Grading Scale'!G$12,'Grading Scale'!E$11,IF(R139<'Grading Scale'!G$11,'Grading Scale'!E$9,IF(R139<'Grading Scale'!G$10,'Grading Scale'!E$7,IF(R139<'Grading Scale'!G$9,'Grading Scale'!E$5,'Grading Scale'!E$3))))),IF(R139<'Grading Scale'!G$7,'Grading Scale'!B$13,IF(R139<'Grading Scale'!G$6,'Grading Scale'!B$11,IF(R139<'Grading Scale'!G$5,'Grading Scale'!B$9,IF(R139<'Grading Scale'!G$4,'Grading Scale'!B$7,IF(R139<'Grading Scale'!G$3,'Grading Scale'!B$5,'Grading Scale'!B$3))))))","v":3},{"$f":"Scores!B130","v":0},{"$f":"IF(S139>='Grading Scale'!B$13,IF(S139='Grading Scale'!B$3,'Grading Scale'!C$3,IF(S139='Grading Scale'!B$5,'Grading Scale'!C$5,IF(S139='Grading Scale'!B$7,'Grading Scale'!C$7,IF(S139='Grading Scale'!B$9,'Grading Scale'!C$9,IF(S139='Grading Scale'!B$11,'Grading Scale'!C$11,'Grading Scale'!C$13))))),IF(S139='Grading Scale'!E$3,'Grading Scale'!F$3,IF(S139='Grading Scale'!E$5,'Grading Scale'!F$5,IF(S139='Grading Scale'!E$7,'Grading Scale'!F$7,IF(S139='Grading Scale'!E$9,'Grading Scale'!F$9,IF(S139='Grading Scale'!E$11,'Grading Scale'!F$11,'Grading Scale'!F$13))))))","v":"B    "}," ",null,""]
[{"$f":"Scores!A131","v":0},{"$f":"Scores!B131","v":0},{"$f":"Scores!C131","v":0},{"$f":"Scores!D131","v":0},{"$f":"Scores!E131","v":0},{"$f":"Scores!F131","v":0},{"$f":"Scores!G131","v":0},{"$f":"Scores!H131","v":0},{"$f":"Scores!I131","v":0},{"$f":"Scores!J131","v":0},{"$f":"Scores!K131","v":0},{"$f":"Scores!L131","v":0},{"$f":"Scores!M131","v":0},{"$f":"Scores!N131","v":0},{"$f":"Scores!O131","v":0},-0.70710678118654746,2.9512994231491119,2.9512994231491119,{"$f":"IF(R140<'Grading Scale'!G$8,IF(R140<'Grading Scale'!G$13,'Grading Scale'!E$13,IF(R140<'Grading Scale'!G$12,'Grading Scale'!E$11,IF(R140<'Grading Scale'!G$11,'Grading Scale'!E$9,IF(R140<'Grading Scale'!G$10,'Grading Scale'!E$7,IF(R140<'Grading Scale'!G$9,'Grading Scale'!E$5,'Grading Scale'!E$3))))),IF(R140<'Grading Scale'!G$7,'Grading Scale'!B$13,IF(R140<'Grading Scale'!G$6,'Grading Scale'!B$11,IF(R140<'Grading Scale'!G$5,'Grading Scale'!B$9,IF(R140<'Grading Scale'!G$4,'Grading Scale'!B$7,IF(R140<'Grading Scale'!G$3,'Grading Scale'!B$5,'Grading Scale'!B$3))))))","v":3},{"$f":"Scores!B131","v":0},{"$f":"IF(S140>='Grading Scale'!B$13,IF(S140='Grading Scale'!B$3,'Grading Scale'!C$3,IF(S140='Grading Scale'!B$5,'Grading Scale'!C$5,IF(S140='Grading Scale'!B$7,'Grading Scale'!C$7,IF(S140='Grading Scale'!B$9,'Grading Scale'!C$9,IF(S140='Grading Scale'!B$11,'Grading Scale'!C$11,'Grading Scale'!C$13))))),IF(S140='Grading Scale'!E$3,'Grading Scale'!F$3,IF(S140='Grading Scale'!E$5,'Grading Scale'!F$5,IF(S140='Grading Scale'!E$7,'Grading Scale'!F$7,IF(S140='Grading Scale'!E$9,'Grading Scale'!F$9,IF(S140='Grading Scale'!E$11,'Grading Scale'!F$11,'Grading Scale'!F$13))))))","v":"B    "}," ",null,""]
[{"$f":"Scores!A132","v":0},{"$f":"Scores!B132","v":0},{"$f":"Scores!C132","v":0},{"$f":"Scores!D132","v":0},{"$f":"Scores!E132","v":0},{"$f":"Scores!F132","v":0},{"$f":"Scores!G132","v":0},{"$f":"Scores!H132","v":0},{"$f":"Scores!I132","v":0},{"$f":"Scores!J132","v":0},{"$f":"Scores!K132","v":0},{"$f":"Scores!L132","v":0},{"$f":"Scores!M132","v":0},{"$f":"Scores!N132","v":0},{"$f":"Scores!O132","v":0},-0.70710678118654746,2.9512994231491119,2.9512994231491119,{"$f":"IF(R141<'Grading Scale'!G$8,IF(R141<'Grading Scale'!G$13,'Grading Scale'!E$13,IF(R141<'Grading Scale'!G$12,'Grading Scale'!E$11,IF(R141<'Grading Scale'!G$11,'Grading Scale'!E$9,IF(R141<'Grading Scale'!G$10,'Grading Scale'!E$7,IF(R141<'Grading Scale'!G$9,'Grading Scale'!E$5,'Grading Scale'!E$3))))),IF(R141<'Grading Scale'!G$7,'Grading Scale'!B$13,IF(R141<'Grading Scale'!G$6,'Grading Scale'!B$11,IF(R141<'Grading Scale'!G$5,'Grading Scale'!B$9,IF(R141<'Grading Scale'!G$4,'Grading Scale'!B$7,IF(R141<'Grading Scale'!G$3,'Grading Scale'!B$5,'Grading Scale'!B$3))))))","v":3},{"$f":"Scores!B132","v":0},{"$f":"IF(S141>='Grading Scale'!B$13,IF(S141='Grading Scale'!B$3,'Grading Scale'!C$3,IF(S141='Grading Scale'!B$5,'Grading Scale'!C$5,IF(S141='Grading Scale'!B$7,'Grading Scale'!C$7,IF(S141='Grading Scale'!B$9,'Grading Scale'!C$9,IF(S141='Grading Scale'!B$11,'Grading Scale'!C$11,'Grading Scale'!C$13))))),IF(S141='Grading Scale'!E$3,'Grading Scale'!F$3,IF(S141='Grading Scale'!E$5,'Grading Scale'!F$5,IF(S141='Grading Scale'!E$7,'Grading Scale'!F$7,IF(S141='Grading Scale'!E$9,'Grading Scale'!F$9,IF(S141='Grading Scale'!E$11,'Grading Scale'!F$11,'Grading Scale'!F$13))))))","v":"B    "}," ",null,""]
[{"$f":"Scores!A133","v":0},{"$f":"Scores!B133","v":0},{"$f":"Scores!C133","v":0},{"$f":"Scores!D133","v":0},{"$f":"Scores!E133","v":0},{"$f":"Scores!F133","v":0},{"$f":"Scores!G133","v":0},{"$f":"Scores!H133","v":0},{"$f":"Scores!I133","v":0},{"$f":"Scores!J133","v":0},{"$f":"Scores!K133","v":0},{"$f":"Scores!L133","v":0},{"$f":"Scores!M133","v":0},{"$f":"Scores!N133","v":0},{"$f":"Scores!O133","v":0},-0.70710678118654746,2.9512994231491119,2.9512994231491119,{"$f":"IF(R142<'Grading Scale'!G$8,IF(R142<'Grading Scale'!G$13,'Grading Scale'!E$13,IF(R142<'Grading Scale'!G$12,'Grading Scale'!E$11,IF(R142<'Grading Scale'!G$11,'Grading Scale'!E$9,IF(R142<'Grading Scale'!G$10,'Grading Scale'!E$7,IF(R142<'Grading Scale'!G$9,'Grading Scale'!E$5,'Grading Scale'!E$3))))),IF(R142<'Grading Scale'!G$7,'Grading Scale'!B$13,IF(R142<'Grading Scale'!G$6,'Grading Scale'!B$11,IF(R142<'Grading Scale'!G$5,'Grading Scale'!B$9,IF(R142<'Grading Scale'!G$4,'Grading Scale'!B$7,IF(R142<'Grading Scale'!G$3,'Grading Scale'!B$5,'Grading Scale'!B$3))))))","v":3},{"$f":"Scores!B133","v":0},{"$f":"IF(S142>='Grading Scale'!B$13,IF(S142='Grading Scale'!B$3,'Grading Scale'!C$3,IF(S142='Grading Scale'!B$5,'Grading Scale'!C$5,IF(S142='Grading Scale'!B$7,'Grading Scale'!C$7,IF(S142='Grading Scale'!B$9,'Grading Scale'!C$9,IF(S142='Grading Scale'!B$11,'Grading Scale'!C$11,'Grading Scale'!C$13))))),IF(S142='Grading Scale'!E$3,'Grading Scale'!F$3,IF(S142='Grading Scale'!E$5,'Grading Scale'!F$5,IF(S142='Grading Scale'!E$7,'Grading Scale'!F$7,IF(S142='Grading Scale'!E$9,'Grading Scale'!F$9,IF(S142='Grading Scale'!E$11,'Grading Scale'!F$11,'Grading Scale'!F$13))))))","v":"B    "}," ",null,""]
[{"$f":"Scores!A134","v":0},{"$f":"Scores!B134","v":0},{"$f":"Scores!C134","v":0},{"$f":"Scores!D134","v":0},{"$f":"Scores!E134","v":0},{"$f":"Scores!F134","v":0},{"$f":"Scores!G134","v":0},{"$f":"Scores!H134","v":0},{"$f":"Scores!I134","v":0},{"$f":"Scores!J134","v":0},{"$f":"Scores!K134","v":0},{"$f":"Scores!L134","v":0},{"$f":"Scores!M134","v":0},{"$f":"Scores!N134","v":0},{"$f":"Scores!O134","v":0},-0.70710678118654746,2.9512994231491119,2.9512994231491119,{"$f":"IF(R143<'Grading Scale'!G$8,IF(R143<'Grading Scale'!G$13,'Grading Scale'!E$13,IF(R143<'Grading Scale'!G$12,'Grading Scale'!E$11,IF(R143<'Grading Scale'!G$11,'Grading Scale'!E$9,IF(R143<'Grading Scale'!G$10,'Grading Scale'!E$7,IF(R143<'Grading Scale'!G$9,'Grading Scale'!E$5,'Grading Scale'!E$3))))),IF(R143<'Grading Scale'!G$7,'Grading Scale'!B$13,IF(R143<'Grading Scale'!G$6,'Grading Scale'!B$11,IF(R143<'Grading Scale'!G$5,'Grading Scale'!B$9,IF(R143<'Grading Scale'!G$4,'Grading Scale'!B$7,IF(R143<'Grading Scale'!G$3,'Grading Scale'!B$5,'Grading Scale'!B$3))))))","v":3},{"$f":"Scores!B134","v":0},{"$f":"IF(S143>='Grading Scale'!B$13,IF(S143='Grading Scale'!B$3,'Grading Scale'!C$3,IF(S143='Grading Scale'!B$5,'Grading Scale'!C$5,IF(S143='Grading Scale'!B$7,'Grading Scale'!C$7,IF(S143='Grading Scale'!B$9,'Grading Scale'!C$9,IF(S143='Grading Scale'!B$11,'Grading Scale'!C$11,'Grading Scale'!C$13))))),IF(S143='Grading Scale'!E$3,'Grading Scale'!F$3,IF(S143='Grading Scale'!E$5,'Grading Scale'!F$5,IF(S143='Grading Scale'!E$7,'Grading Scale'!F$7,IF(S143='Grading Scale'!E$9,'Grading Scale'!F$9,IF(S143='Grading Scale'!E$11,'Grading Scale'!F$11,'Grading Scale'!F$13))))))","v":"B    "}," ",null,""]
[{"$f":"Scores!A135","v":0},{"$f":"Scores!B135","v":0},{"$f":"Scores!C135","v":0},{"$f":"Scores!D135","v":0},{"$f":"Scores!E135","v":0},{"$f":"Scores!F135","v":0},{"$f":"Scores!G135","v":0},{"$f":"Scores!H135","v":0},{"$f":"Scores!I135","v":0},{"$f":"Scores!J135","v":0},{"$f":"Scores!K135","v":0},{"$f":"Scores!L135","v":0},{"$f":"Scores!M135","v":0},{"$f":"Scores!N135","v":0},{"$f":"Scores!O135","v":0},-0.70710678118654746,2.9512994231491119,2.9512994231491119,{"$f":"IF(R144<'Grading Scale'!G$8,IF(R144<'Grading Scale'!G$13,'Grading Scale'!E$13,IF(R144<'Grading Scale'!G$12,'Grading Scale'!E$11,IF(R144<'Grading Scale'!G$11,'Grading Scale'!E$9,IF(R144<'Grading Scale'!G$10,'Grading Scale'!E$7,IF(R144<'Grading Scale'!G$9,'Grading Scale'!E$5,'Grading Scale'!E$3))))),IF(R144<'Grading Scale'!G$7,'Grading Scale'!B$13,IF(R144<'Grading Scale'!G$6,'Grading Scale'!B$11,IF(R144<'Grading Scale'!G$5,'Grading Scale'!B$9,IF(R144<'Grading Scale'!G$4,'Grading Scale'!B$7,IF(R144<'Grading Scale'!G$3,'Grading Scale'!B$5,'Grading Scale'!B$3))))))","v":3},{"$f":"Scores!B135","v":0},{"$f":"IF(S144>='Grading Scale'!B$13,IF(S144='Grading Scale'!B$3,'Grading Scale'!C$3,IF(S144='Grading Scale'!B$5,'Grading Scale'!C$5,IF(S144='Grading Scale'!B$7,'Grading Scale'!C$7,IF(S144='Grading Scale'!B$9,'Grading Scale'!C$9,IF(S144='Grading Scale'!B$11,'Grading Scale'!C$11,'Grading Scale'!C$13))))),IF(S144='Grading Scale'!E$3,'Grading Scale'!F$3,IF(S144='Grading Scale'!E$5,'Grading Scale'!F$5,IF(S144='Grading Scale'!E$7,'Grading Scale'!F$7,IF(S144='Grading Scale'!E$9,'Grading Scale'!F$9,IF(S144='Grading Scale'!E$11,'Grading Scale'!F$11,'Grading Scale'!F$13))))))","v":"B    "}," ",null,""]
[{"$f":"Scores!A136","v":0},{"$f":"Scores!B136","v":0},{"$f":"Scores!C136","v":0},{"$f":"Scores!D136","v":0},{"$f":"Scores!E136","v":0},{"$f":"Scores!F136","v":0},{"$f":"Scores!G136","v":0},{"$f":"Scores!H136","v":0},{"$f":"Scores!I136","v":0},{"$f":"Scores!J136","v":0},{"$f":"Scores!K136","v":0},{"$f":"Scores!L136","v":0},{"$f":"Scores!M136","v":0},{"$f":"Scores!N136","v":0},{"$f":"Scores!O136","v":0},-0.70710678118654746,2.9512994231491119,2.9512994231491119,{"$f":"IF(R145<'Grading Scale'!G$8,IF(R145<'Grading Scale'!G$13,'Grading Scale'!E$13,IF(R145<'Grading Scale'!G$12,'Grading Scale'!E$11,IF(R145<'Grading Scale'!G$11,'Grading Scale'!E$9,IF(R145<'Grading Scale'!G$10,'Grading Scale'!E$7,IF(R145<'Grading Scale'!G$9,'Grading Scale'!E$5,'Grading Scale'!E$3))))),IF(R145<'Grading Scale'!G$7,'Grading Scale'!B$13,IF(R145<'Grading Scale'!G$6,'Grading Scale'!B$11,IF(R145<'Grading Scale'!G$5,'Grading Scale'!B$9,IF(R145<'Grading Scale'!G$4,'Grading Scale'!B$7,IF(R145<'Grading Scale'!G$3,'Grading Scale'!B$5,'Grading Scale'!B$3))))))","v":3},{"$f":"Scores!B136","v":0},{"$f":"IF(S145>='Grading Scale'!B$13,IF(S145='Grading Scale'!B$3,'Grading Scale'!C$3,IF(S145='Grading Scale'!B$5,'Grading Scale'!C$5,IF(S145='Grading Scale'!B$7,'Grading Scale'!C$7,IF(S145='Grading Scale'!B$9,'Grading Scale'!C$9,IF(S145='Grading Scale'!B$11,'Grading Scale'!C$11,'Grading Scale'!C$13))))),IF(S145='Grading Scale'!E$3,'Grading Scale'!F$3,IF(S145='Grading Scale'!E$5,'Grading Scale'!F$5,IF(S145='Grading Scale'!E$7,'Grading Scale'!F$7,IF(S145='Grading Scale'!E$9,'Grading Scale'!F$9,IF(S145='Grading Scale'!E$11,'Grading Scale'!F$11,'Grading Scale'!F$13))))))","v":"B    "}," ",null,""]
[{"$f":"Scores!A137","v":0},{"$f":"Scores!B137","v":0},{"$f":"Scores!C137","v":0},{"$f":"Scores!D137","v":0},{"$f":"Scores!E137","v":0},{"$f":"Scores!F137","v":0},{"$f":"Scores!G137","v":0},{"$f":"Scores!H137","v":0},{"$f":"Scores!I137","v":0},{"$f":"Scores!J137","v":0},{"$f":"Scores!K137","v":0},{"$f":"Scores!L137","v":0},{"$f":"Scores!M137","v":0},{"$f":"Scores!N137","v":0},{"$f":"Scores!O137","v":0},-0.70710678118654746,2.9512994231491119,2.9512994231491119,{"$f":"IF(R146<'Grading Scale'!G$8,IF(R146<'Grading Scale'!G$13,'Grading Scale'!E$13,IF(R146<'Grading Scale'!G$12,'Grading Scale'!E$11,IF(R146<'Grading Scale'!G$11,'Grading Scale'!E$9,IF(R146<'Grading Scale'!G$10,'Grading Scale'!E$7,IF(R146<'Grading Scale'!G$9,'Grading Scale'!E$5,'Grading Scale'!E$3))))),IF(R146<'Grading Scale'!G$7,'Grading Scale'!B$13,IF(R146<'Grading Scale'!G$6,'Grading Scale'!B$11,IF(R146<'Grading Scale'!G$5,'Grading Scale'!B$9,IF(R146<'Grading Scale'!G$4,'Grading Scale'!B$7,IF(R146<'Grading Scale'!G$3,'Grading Scale'!B$5,'Grading Scale'!B$3))))))","v":3},{"$f":"Scores!B137","v":0},{"$f":"IF(S146>='Grading Scale'!B$13,IF(S146='Grading Scale'!B$3,'Grading Scale'!C$3,IF(S146='Grading Scale'!B$5,'Grading Scale'!C$5,IF(S146='Grading Scale'!B$7,'Grading Scale'!C$7,IF(S146='Grading Scale'!B$9,'Grading Scale'!C$9,IF(S146='Grading Scale'!B$11,'Grading Scale'!C$11,'Grading Scale'!C$13))))),IF(S146='Grading Scale'!E$3,'Grading Scale'!F$3,IF(S146='Grading Scale'!E$5,'Grading Scale'!F$5,IF(S146='Grading Scale'!E$7,'Grading Scale'!F$7,IF(S146='Grading Scale'!E$9,'Grading Scale'!F$9,IF(S146='Grading Scale'!E$11,'Grading Scale'!F$11,'Grading Scale'!F$13))))))","v":"B    "}," ",null,""]
[{"$f":"Scores!A138","v":0},{"$f":"Scores!B138","v":0},{"$f":"Scores!C138","v":0},{"$f":"Scores!D138","v":0},{"$f":"Scores!E138","v":0},{"$f":"Scores!F138","v":0},{"$f":"Scores!G138","v":0},{"$f":"Scores!H138","v":0},{"$f":"Scores!I138","v":0},{"$f":"Scores!J138","v":0},{"$f":"Scores!K138","v":0},{"$f":"Scores!L138","v":0},{"$f":"Scores!M138","v":0},{"$f":"Scores!N138","v":0},{"$f":"Scores!O138","v":0},-0.70710678118654746,2.9512994231491119,2.9512994231491119,{"$f":"IF(R147<'Grading Scale'!G$8,IF(R147<'Grading Scale'!G$13,'Grading Scale'!E$13,IF(R147<'Grading Scale'!G$12,'Grading Scale'!E$11,IF(R147<'Grading Scale'!G$11,'Grading Scale'!E$9,IF(R147<'Grading Scale'!G$10,'Grading Scale'!E$7,IF(R147<'Grading Scale'!G$9,'Grading Scale'!E$5,'Grading Scale'!E$3))))),IF(R147<'Grading Scale'!G$7,'Grading Scale'!B$13,IF(R147<'Grading Scale'!G$6,'Grading Scale'!B$11,IF(R147<'Grading Scale'!G$5,'Grading Scale'!B$9,IF(R147<'Grading Scale'!G$4,'Grading Scale'!B$7,IF(R147<'Grading Scale'!G$3,'Grading Scale'!B$5,'Grading Scale'!B$3))))))","v":3},{"$f":"Scores!B138","v":0},{"$f":"IF(S147>='Grading Scale'!B$13,IF(S147='Grading Scale'!B$3,'Grading Scale'!C$3,IF(S147='Grading Scale'!B$5,'Grading Scale'!C$5,IF(S147='Grading Scale'!B$7,'Grading Scale'!C$7,IF(S147='Grading Scale'!B$9,'Grading Scale'!C$9,IF(S147='Grading Scale'!B$11,'Grading Scale'!C$11,'Grading Scale'!C$13))))),IF(S147='Grading Scale'!E$3,'Grading Scale'!F$3,IF(S147='Grading Scale'!E$5,'Grading Scale'!F$5,IF(S147='Grading Scale'!E$7,'Grading Scale'!F$7,IF(S147='Grading Scale'!E$9,'Grading Scale'!F$9,IF(S147='Grading Scale'!E$11,'Grading Scale'!F$11,'Grading Scale'!F$13))))))","v":"B    "}," ",null,""]
[{"$f":"Scores!A139","v":0},{"$f":"Scores!B139","v":0},{"$f":"Scores!C139","v":0},{"$f":"Scores!D139","v":0},{"$f":"Scores!E139","v":0},{"$f":"Scores!F139","v":0},{"$f":"Scores!G139","v":0},{"$f":"Scores!H139","v":0},{"$f":"Scores!I139","v":0},{"$f":"Scores!J139","v":0},{"$f":"Scores!K139","v":0},{"$f":"Scores!L139","v":0},{"$f":"Scores!M139","v":0},{"$f":"Scores!N139","v":0},{"$f":"Scores!O139","v":0},-0.70710678118654746,2.9512994231491119,2.9512994231491119,{"$f":"IF(R148<'Grading Scale'!G$8,IF(R148<'Grading Scale'!G$13,'Grading Scale'!E$13,IF(R148<'Grading Scale'!G$12,'Grading Scale'!E$11,IF(R148<'Grading Scale'!G$11,'Grading Scale'!E$9,IF(R148<'Grading Scale'!G$10,'Grading Scale'!E$7,IF(R148<'Grading Scale'!G$9,'Grading Scale'!E$5,'Grading Scale'!E$3))))),IF(R148<'Grading Scale'!G$7,'Grading Scale'!B$13,IF(R148<'Grading Scale'!G$6,'Grading Scale'!B$11,IF(R148<'Grading Scale'!G$5,'Grading Scale'!B$9,IF(R148<'Grading Scale'!G$4,'Grading Scale'!B$7,IF(R148<'Grading Scale'!G$3,'Grading Scale'!B$5,'Grading Scale'!B$3))))))","v":3},{"$f":"Scores!B139","v":0},{"$f":"IF(S148>='Grading Scale'!B$13,IF(S148='Grading Scale'!B$3,'Grading Scale'!C$3,IF(S148='Grading Scale'!B$5,'Grading Scale'!C$5,IF(S148='Grading Scale'!B$7,'Grading Scale'!C$7,IF(S148='Grading Scale'!B$9,'Grading Scale'!C$9,IF(S148='Grading Scale'!B$11,'Grading Scale'!C$11,'Grading Scale'!C$13))))),IF(S148='Grading Scale'!E$3,'Grading Scale'!F$3,IF(S148='Grading Scale'!E$5,'Grading Scale'!F$5,IF(S148='Grading Scale'!E$7,'Grading Scale'!F$7,IF(S148='Grading Scale'!E$9,'Grading Scale'!F$9,IF(S148='Grading Scale'!E$11,'Grading Scale'!F$11,'Grading Scale'!F$13))))))","v":"B    "}," ",null,""]
[{"$f":"Scores!A140","v":0},{"$f":"Scores!B140","v":0},{"$f":"Scores!C140","v":0},{"$f":"Scores!D140","v":0},{"$f":"Scores!E140","v":0},{"$f":"Scores!F140","v":0},{"$f":"Scores!G140","v":0},{"$f":"Scores!H140","v":0},{"$f":"Scores!I140","v":0},{"$f":"Scores!J140","v":0},{"$f":"Scores!K140","v":0},{"$f":"Scores!L140","v":0},{"$f":"Scores!M140","v":0},{"$f":"Scores!N140","v":0},{"$f":"Scores!O140","v":0},-0.70710678118654746,2.9512994231491119,2.9512994231491119,{"$f":"IF(R149<'Grading Scale'!G$8,IF(R149<'Grading Scale'!G$13,'Grading Scale'!E$13,IF(R149<'Grading Scale'!G$12,'Grading Scale'!E$11,IF(R149<'Grading Scale'!G$11,'Grading Scale'!E$9,IF(R149<'Grading Scale'!G$10,'Grading Scale'!E$7,IF(R149<'Grading Scale'!G$9,'Grading Scale'!E$5,'Grading Scale'!E$3))))),IF(R149<'Grading Scale'!G$7,'Grading Scale'!B$13,IF(R149<'Grading Scale'!G$6,'Grading Scale'!B$11,IF(R149<'Grading Scale'!G$5,'Grading Scale'!B$9,IF(R149<'Grading Scale'!G$4,'Grading Scale'!B$7,IF(R149<'Grading Scale'!G$3,'Grading Scale'!B$5,'Grading Scale'!B$3))))))","v":3},{"$f":"Scores!B140","v":0},{"$f":"IF(S149>='Grading Scale'!B$13,IF(S149='Grading Scale'!B$3,'Grading Scale'!C$3,IF(S149='Grading Scale'!B$5,'Grading Scale'!C$5,IF(S149='Grading Scale'!B$7,'Grading Scale'!C$7,IF(S149='Grading Scale'!B$9,'Grading Scale'!C$9,IF(S149='Grading Scale'!B$11,'Grading Scale'!C$11,'Grading Scale'!C$13))))),IF(S149='Grading Scale'!E$3,'Grading Scale'!F$3,IF(S149='Grading Scale'!E$5,'Grading Scale'!F$5,IF(S149='Grading Scale'!E$7,'Grading Scale'!F$7,IF(S149='Grading Scale'!E$9,'Grading Scale'!F$9,IF(S149='Grading Scale'!E$11,'Grading Scale'!F$11,'Grading Scale'!F$13))))))","v":"B    "}," ",null,""]
[{"$f":"Scores!A141","v":0},{"$f":"Scores!B141","v":0},{"$f":"Scores!C141","v":0},{"$f":"Scores!D141","v":0},{"$f":"Scores!E141","v":0},{"$f":"Scores!F141","v":0},{"$f":"Scores!G141","v":0},{"$f":"Scores!H141","v":0},{"$f":"Scores!I141","v":0},{"$f":"Scores!J141","v":0},{"$f":"Scores!K141","v":0},{"$f":"Scores!L141","v":0},{"$f":"Scores!M141","v":0},{"$f":"Scores!N141","v":0},{"$f":"Scores!O141","v":0},-0.70710678118654746,2.9512994231491119,2.9512994231491119,{"$f":"IF(R150<'Grading Scale'!G$8,IF(R150<'Grading Scale'!G$13,'Grading Scale'!E$13,IF(R150<'Grading Scale'!G$12,'Grading Scale'!E$11,IF(R150<'Grading Scale'!G$11,'Grading Scale'!E$9,IF(R150<'Grading Scale'!G$10,'Grading Scale'!E$7,IF(R150<'Grading Scale'!G$9,'Grading Scale'!E$5,'Grading Scale'!E$3))))),IF(R150<'Grading Scale'!G$7,'Grading Scale'!B$13,IF(R150<'Grading Scale'!G$6,'Grading Scale'!B$11,IF(R150<'Grading Scale'!G$5,'Grading Scale'!B$9,IF(R150<'Grading Scale'!G$4,'Grading Scale'!B$7,IF(R150<'Grading Scale'!G$3,'Grading Scale'!B$5,'Grading Scale'!B$3))))))","v":3},{"$f":"Scores!B141","v":0},{"$f":"IF(S150>='Grading Scale'!B$13,IF(S150='Grading Scale'!B$3,'Grading Scale'!C$3,IF(S150='Grading Scale'!B$5,'Grading Scale'!C$5,IF(S150='Grading Scale'!B$7,'Grading Scale'!C$7,IF(S150='Grading Scale'!B$9,'Grading Scale'!C$9,IF(S150='Grading Scale'!B$11,'Grading Scale'!C$11,'Grading Scale'!C$13))))),IF(S150='Grading Scale'!E$3,'Grading Scale'!F$3,IF(S150='Grading Scale'!E$5,'Grading Scale'!F$5,IF(S150='Grading Scale'!E$7,'Grading Scale'!F$7,IF(S150='Grading Scale'!E$9,'Grading Scale'!F$9,IF(S150='Grading Scale'!E$11,'Grading Scale'!F$11,'Grading Scale'!F$13))))))","v":"B    "}," ",null,""]
[{"$f":"Scores!A142","v":0},{"$f":"Scores!B142","v":0},{"$f":"Scores!C142","v":0},{"$f":"Scores!D142","v":0},{"$f":"Scores!E142","v":0},{"$f":"Scores!F142","v":0},{"$f":"Scores!G142","v":0},{"$f":"Scores!H142","v":0},{"$f":"Scores!I142","v":0},{"$f":"Scores!J142","v":0},{"$f":"Scores!K142","v":0},{"$f":"Scores!L142","v":0},{"$f":"Scores!M142","v":0},{"$f":"Scores!N142","v":0},{"$f":"Scores!O142","v":0},{"$f":"(C151-$C$17)*$C$19+(D151-$D$17)*$D$19+(E151-$E$17)*$E$19+(F151-$F$17)*$F$19+(G151-$G$17)*$G$19+(H151-$H$17)*$H$19+(I151-$I$17)*$I$19+(J151-$J$17)*$J$19+(K151-$K$17)*$K$19+(L151-$L$17)*$L$19","v":-0.70710678118654746},{"$f":"(((P151-$P$19)/$P$16)*$S$2)+$S$1","v":2.9512994231491119},{"$f":"Q151+(N151*N$21)+(O151*O$21)","v":2.9512994231491119},{"$f":"IF(R151<'Grading Scale'!G$8,IF(R151<'Grading Scale'!G$13,'Grading Scale'!E$13,IF(R151<'Grading Scale'!G$12,'Grading Scale'!E$11,IF(R151<'Grading Scale'!G$11,'Grading Scale'!E$9,IF(R151<'Grading Scale'!G$10,'Grading Scale'!E$7,IF(R151<'Grading Scale'!G$9,'Grading Scale'!E$5,'Grading Scale'!E$3))))),IF(R151<'Grading Scale'!G$7,'Grading Scale'!B$13,IF(R151<'Grading Scale'!G$6,'Grading Scale'!B$11,IF(R151<'Grading Scale'!G$5,'Grading Scale'!B$9,IF(R151<'Grading Scale'!G$4,'Grading Scale'!B$7,IF(R151<'Grading Scale'!G$3,'Grading Scale'!B$5,'Grading Scale'!B$3))))))","v":3},{"$f":"Scores!B142","v":0},{"$f":"IF(S151>='Grading Scale'!B$13,IF(S151='Grading Scale'!B$3,'Grading Scale'!C$3,IF(S151='Grading Scale'!B$5,'Grading Scale'!C$5,IF(S151='Grading Scale'!B$7,'Grading Scale'!C$7,IF(S151='Grading Scale'!B$9,'Grading Scale'!C$9,IF(S151='Grading Scale'!B$11,'Grading Scale'!C$11,'Grading Scale'!C$13))))),IF(S151='Grading Scale'!E$3,'Grading Scale'!F$3,IF(S151='Grading Scale'!E$5,'Grading Scale'!F$5,IF(S151='Grading Scale'!E$7,'Grading Scale'!F$7,IF(S151='Grading Scale'!E$9,'Grading Scale'!F$9,IF(S151='Grading Scale'!E$11,'Grading Scale'!F$11,'Grading Scale'!F$13))))))","v":"B    "},{"$f":"IF(P151=$P$17,\"BEST\",\" \")","v":" "},null,{"$f":"IF(W151=0,\"\",IF(W151=S151,\"\",IF(W151>S151,\"dropped\",\"increased\")))","v":""}]
[{"$f":"Scores!A143","v":0},{"$f":"Scores!B143","v":0},{"$f":"Scores!C143","v":0},{"$f":"Scores!D143","v":0},{"$f":"Scores!E143","v":0},{"$f":"Scores!F143","v":0},{"$f":"Scores!G143","v":0},{"$f":"Scores!H143","v":0},{"$f":"Scores!I143","v":0},{"$f":"Scores!J143","v":0},{"$f":"Scores!K143","v":0},{"$f":"Scores!L143","v":0},{"$f":"Scores!M143","v":0},{"$f":"Scores!N143","v":0},{"$f":"Scores!O143","v":0},-0.70710678118654746,2.9512994231491119,2.9512994231491119,{"$f":"IF(R152<'Grading Scale'!G$8,IF(R152<'Grading Scale'!G$13,'Grading Scale'!E$13,IF(R152<'Grading Scale'!G$12,'Grading Scale'!E$11,IF(R152<'Grading Scale'!G$11,'Grading Scale'!E$9,IF(R152<'Grading Scale'!G$10,'Grading Scale'!E$7,IF(R152<'Grading Scale'!G$9,'Grading Scale'!E$5,'Grading Scale'!E$3))))),IF(R152<'Grading Scale'!G$7,'Grading Scale'!B$13,IF(R152<'Grading Scale'!G$6,'Grading Scale'!B$11,IF(R152<'Grading Scale'!G$5,'Grading Scale'!B$9,IF(R152<'Grading Scale'!G$4,'Grading Scale'!B$7,IF(R152<'Grading Scale'!G$3,'Grading Scale'!B$5,'Grading Scale'!B$3))))))","v":3},{"$f":"Scores!B143","v":0},{"$f":"IF(S152>='Grading Scale'!B$13,IF(S152='Grading Scale'!B$3,'Grading Scale'!C$3,IF(S152='Grading Scale'!B$5,'Grading Scale'!C$5,IF(S152='Grading Scale'!B$7,'Grading Scale'!C$7,IF(S152='Grading Scale'!B$9,'Grading Scale'!C$9,IF(S152='Grading Scale'!B$11,'Grading Scale'!C$11,'Grading Scale'!C$13))))),IF(S152='Grading Scale'!E$3,'Grading Scale'!F$3,IF(S152='Grading Scale'!E$5,'Grading Scale'!F$5,IF(S152='Grading Scale'!E$7,'Grading Scale'!F$7,IF(S152='Grading Scale'!E$9,'Grading Scale'!F$9,IF(S152='Grading Scale'!E$11,'Grading Scale'!F$11,'Grading Scale'!F$13))))))","v":"B    "}," ",null,""]
[{"$f":"Scores!A144","v":0},{"$f":"Scores!B144","v":0},{"$f":"Scores!C144","v":0},{"$f":"Scores!D144","v":0},{"$f":"Scores!E144","v":0},{"$f":"Scores!F144","v":0},{"$f":"Scores!G144","v":0},{"$f":"Scores!H144","v":0},{"$f":"Scores!I144","v":0},{"$f":"Scores!J144","v":0},{"$f":"Scores!K144","v":0},{"$f":"Scores!L144","v":0},{"$f":"Scores!M144","v":0},{"$f":"Scores!N144","v":0},{"$f":"Scores!O144","v":0},-0.70710678118654746,2.9512994231491119,2.9512994231491119,{"$f":"IF(R153<'Grading Scale'!G$8,IF(R153<'Grading Scale'!G$13,'Grading Scale'!E$13,IF(R153<'Grading Scale'!G$12,'Grading Scale'!E$11,IF(R153<'Grading Scale'!G$11,'Grading Scale'!E$9,IF(R153<'Grading Scale'!G$10,'Grading Scale'!E$7,IF(R153<'Grading Scale'!G$9,'Grading Scale'!E$5,'Grading Scale'!E$3))))),IF(R153<'Grading Scale'!G$7,'Grading Scale'!B$13,IF(R153<'Grading Scale'!G$6,'Grading Scale'!B$11,IF(R153<'Grading Scale'!G$5,'Grading Scale'!B$9,IF(R153<'Grading Scale'!G$4,'Grading Scale'!B$7,IF(R153<'Grading Scale'!G$3,'Grading Scale'!B$5,'Grading Scale'!B$3))))))","v":3},{"$f":"Scores!B144","v":0},{"$f":"IF(S153>='Grading Scale'!B$13,IF(S153='Grading Scale'!B$3,'Grading Scale'!C$3,IF(S153='Grading Scale'!B$5,'Grading Scale'!C$5,IF(S153='Grading Scale'!B$7,'Grading Scale'!C$7,IF(S153='Grading Scale'!B$9,'Grading Scale'!C$9,IF(S153='Grading Scale'!B$11,'Grading Scale'!C$11,'Grading Scale'!C$13))))),IF(S153='Grading Scale'!E$3,'Grading Scale'!F$3,IF(S153='Grading Scale'!E$5,'Grading Scale'!F$5,IF(S153='Grading Scale'!E$7,'Grading Scale'!F$7,IF(S153='Grading Scale'!E$9,'Grading Scale'!F$9,IF(S153='Grading Scale'!E$11,'Grading Scale'!F$11,'Grading Scale'!F$13))))))","v":"B    "}," ",null,""]
[{"$f":"Scores!A145","v":0},{"$f":"Scores!B145","v":0},{"$f":"Scores!C145","v":0},{"$f":"Scores!D145","v":0},{"$f":"Scores!E145","v":0},{"$f":"Scores!F145","v":0},{"$f":"Scores!G145","v":0},{"$f":"Scores!H145","v":0},{"$f":"Scores!I145","v":0},{"$f":"Scores!J145","v":0},{"$f":"Scores!K145","v":0},{"$f":"Scores!L145","v":0},{"$f":"Scores!M145","v":0},{"$f":"Scores!N145","v":0},{"$f":"Scores!O145","v":0},-0.70710678118654746,2.9512994231491119,2.9512994231491119,{"$f":"IF(R154<'Grading Scale'!G$8,IF(R154<'Grading Scale'!G$13,'Grading Scale'!E$13,IF(R154<'Grading Scale'!G$12,'Grading Scale'!E$11,IF(R154<'Grading Scale'!G$11,'Grading Scale'!E$9,IF(R154<'Grading Scale'!G$10,'Grading Scale'!E$7,IF(R154<'Grading Scale'!G$9,'Grading Scale'!E$5,'Grading Scale'!E$3))))),IF(R154<'Grading Scale'!G$7,'Grading Scale'!B$13,IF(R154<'Grading Scale'!G$6,'Grading Scale'!B$11,IF(R154<'Grading Scale'!G$5,'Grading Scale'!B$9,IF(R154<'Grading Scale'!G$4,'Grading Scale'!B$7,IF(R154<'Grading Scale'!G$3,'Grading Scale'!B$5,'Grading Scale'!B$3))))))","v":3},{"$f":"Scores!B145","v":0},{"$f":"IF(S154>='Grading Scale'!B$13,IF(S154='Grading Scale'!B$3,'Grading Scale'!C$3,IF(S154='Grading Scale'!B$5,'Grading Scale'!C$5,IF(S154='Grading Scale'!B$7,'Grading Scale'!C$7,IF(S154='Grading Scale'!B$9,'Grading Scale'!C$9,IF(S154='Grading Scale'!B$11,'Grading Scale'!C$11,'Grading Scale'!C$13))))),IF(S154='Grading Scale'!E$3,'Grading Scale'!F$3,IF(S154='Grading Scale'!E$5,'Grading Scale'!F$5,IF(S154='Grading Scale'!E$7,'Grading Scale'!F$7,IF(S154='Grading Scale'!E$9,'Grading Scale'!F$9,IF(S154='Grading Scale'!E$11,'Grading Scale'!F$11,'Grading Scale'!F$13))))))","v":"B    "}," ",null,""]
[{"$f":"Scores!A146","v":0},{"$f":"Scores!B146","v":0},{"$f":"Scores!C146","v":0},{"$f":"Scores!D146","v":0},{"$f":"Scores!E146","v":0},{"$f":"Scores!F146","v":0},{"$f":"Scores!G146","v":0},{"$f":"Scores!H146","v":0},{"$f":"Scores!I146","v":0},{"$f":"Scores!J146","v":0},{"$f":"Scores!K146","v":0},{"$f":"Scores!L146","v":0},{"$f":"Scores!M146","v":0},{"$f":"Scores!N146","v":0},{"$f":"Scores!O146","v":0},-0.70710678118654746,2.9512994231491119,2.9512994231491119,{"$f":"IF(R155<'Grading Scale'!G$8,IF(R155<'Grading Scale'!G$13,'Grading Scale'!E$13,IF(R155<'Grading Scale'!G$12,'Grading Scale'!E$11,IF(R155<'Grading Scale'!G$11,'Grading Scale'!E$9,IF(R155<'Grading Scale'!G$10,'Grading Scale'!E$7,IF(R155<'Grading Scale'!G$9,'Grading Scale'!E$5,'Grading Scale'!E$3))))),IF(R155<'Grading Scale'!G$7,'Grading Scale'!B$13,IF(R155<'Grading Scale'!G$6,'Grading Scale'!B$11,IF(R155<'Grading Scale'!G$5,'Grading Scale'!B$9,IF(R155<'Grading Scale'!G$4,'Grading Scale'!B$7,IF(R155<'Grading Scale'!G$3,'Grading Scale'!B$5,'Grading Scale'!B$3))))))","v":3},{"$f":"Scores!B146","v":0},{"$f":"IF(S155>='Grading Scale'!B$13,IF(S155='Grading Scale'!B$3,'Grading Scale'!C$3,IF(S155='Grading Scale'!B$5,'Grading Scale'!C$5,IF(S155='Grading Scale'!B$7,'Grading Scale'!C$7,IF(S155='Grading Scale'!B$9,'Grading Scale'!C$9,IF(S155='Grading Scale'!B$11,'Grading Scale'!C$11,'Grading Scale'!C$13))))),IF(S155='Grading Scale'!E$3,'Grading Scale'!F$3,IF(S155='Grading Scale'!E$5,'Grading Scale'!F$5,IF(S155='Grading Scale'!E$7,'Grading Scale'!F$7,IF(S155='Grading Scale'!E$9,'Grading Scale'!F$9,IF(S155='Grading Scale'!E$11,'Grading Scale'!F$11,'Grading Scale'!F$13))))))","v":"B    "}," ",null,""]
[{"$f":"Scores!A147","v":0},{"$f":"Scores!B147","v":0},{"$f":"Scores!C147","v":0},{"$f":"Scores!D147","v":0},{"$f":"Scores!E147","v":0},{"$f":"Scores!F147","v":0},{"$f":"Scores!G147","v":0},{"$f":"Scores!H147","v":0},{"$f":"Scores!I147","v":0},{"$f":"Scores!J147","v":0},{"$f":"Scores!K147","v":0},{"$f":"Scores!L147","v":0},{"$f":"Scores!M147","v":0},{"$f":"Scores!N147","v":0},{"$f":"Scores!O147","v":0},-0.70710678118654746,2.9512994231491119,2.9512994231491119,{"$f":"IF(R156<'Grading Scale'!G$8,IF(R156<'Grading Scale'!G$13,'Grading Scale'!E$13,IF(R156<'Grading Scale'!G$12,'Grading Scale'!E$11,IF(R156<'Grading Scale'!G$11,'Grading Scale'!E$9,IF(R156<'Grading Scale'!G$10,'Grading Scale'!E$7,IF(R156<'Grading Scale'!G$9,'Grading Scale'!E$5,'Grading Scale'!E$3))))),IF(R156<'Grading Scale'!G$7,'Grading Scale'!B$13,IF(R156<'Grading Scale'!G$6,'Grading Scale'!B$11,IF(R156<'Grading Scale'!G$5,'Grading Scale'!B$9,IF(R156<'Grading Scale'!G$4,'Grading Scale'!B$7,IF(R156<'Grading Scale'!G$3,'Grading Scale'!B$5,'Grading Scale'!B$3))))))","v":3},{"$f":"Scores!B147","v":0},{"$f":"IF(S156>='Grading Scale'!B$13,IF(S156='Grading Scale'!B$3,'Grading Scale'!C$3,IF(S156='Grading Scale'!B$5,'Grading Scale'!C$5,IF(S156='Grading Scale'!B$7,'Grading Scale'!C$7,IF(S156='Grading Scale'!B$9,'Grading Scale'!C$9,IF(S156='Grading Scale'!B$11,'Grading Scale'!C$11,'Grading Scale'!C$13))))),IF(S156='Grading Scale'!E$3,'Grading Scale'!F$3,IF(S156='Grading Scale'!E$5,'Grading Scale'!F$5,IF(S156='Grading Scale'!E$7,'Grading Scale'!F$7,IF(S156='Grading Scale'!E$9,'Grading Scale'!F$9,IF(S156='Grading Scale'!E$11,'Grading Scale'!F$11,'Grading Scale'!F$13))))))","v":"B    "}," ",null,""]
[{"$f":"Scores!A148","v":0},{"$f":"Scores!B148","v":0},{"$f":"Scores!C148","v":0},{"$f":"Scores!D148","v":0},{"$f":"Scores!E148","v":0},{"$f":"Scores!F148","v":0},{"$f":"Scores!G148","v":0},{"$f":"Scores!H148","v":0},{"$f":"Scores!I148","v":0},{"$f":"Scores!J148","v":0},{"$f":"Scores!K148","v":0},{"$f":"Scores!L148","v":0},{"$f":"Scores!M148","v":0},{"$f":"Scores!N148","v":0},{"$f":"Scores!O148","v":0},-0.70710678118654746,2.9512994231491119,2.9512994231491119,{"$f":"IF(R157<'Grading Scale'!G$8,IF(R157<'Grading Scale'!G$13,'Grading Scale'!E$13,IF(R157<'Grading Scale'!G$12,'Grading Scale'!E$11,IF(R157<'Grading Scale'!G$11,'Grading Scale'!E$9,IF(R157<'Grading Scale'!G$10,'Grading Scale'!E$7,IF(R157<'Grading Scale'!G$9,'Grading Scale'!E$5,'Grading Scale'!E$3))))),IF(R157<'Grading Scale'!G$7,'Grading Scale'!B$13,IF(R157<'Grading Scale'!G$6,'Grading Scale'!B$11,IF(R157<'Grading Scale'!G$5,'Grading Scale'!B$9,IF(R157<'Grading Scale'!G$4,'Grading Scale'!B$7,IF(R157<'Grading Scale'!G$3,'Grading Scale'!B$5,'Grading Scale'!B$3))))))","v":3},{"$f":"Scores!B148","v":0},{"$f":"IF(S157>='Grading Scale'!B$13,IF(S157='Grading Scale'!B$3,'Grading Scale'!C$3,IF(S157='Grading Scale'!B$5,'Grading Scale'!C$5,IF(S157='Grading Scale'!B$7,'Grading Scale'!C$7,IF(S157='Grading Scale'!B$9,'Grading Scale'!C$9,IF(S157='Grading Scale'!B$11,'Grading Scale'!C$11,'Grading Scale'!C$13))))),IF(S157='Grading Scale'!E$3,'Grading Scale'!F$3,IF(S157='Grading Scale'!E$5,'Grading Scale'!F$5,IF(S157='Grading Scale'!E$7,'Grading Scale'!F$7,IF(S157='Grading Scale'!E$9,'Grading Scale'!F$9,IF(S157='Grading Scale'!E$11,'Grading Scale'!F$11,'Grading Scale'!F$13))))))","v":"B    "}," ",null,""]
[{"$f":"Scores!A149","v":0},{"$f":"Scores!B149","v":0},{"$f":"Scores!C149","v":0},{"$f":"Scores!D149","v":0},{"$f":"Scores!E149","v":0},{"$f":"Scores!F149","v":0},{"$f":"Scores!G149","v":0},{"$f":"Scores!H149","v":0},{"$f":"Scores!I149","v":0},{"$f":"Scores!J149","v":0},{"$f":"Scores!K149","v":0},{"$f":"Scores!L149","v":0},{"$f":"Scores!M149","v":0},{"$f":"Scores!N149","v":0},{"$f":"Scores!O149","v":0},-0.70710678118654746,2.9512994231491119,2.9512994231491119,{"$f":"IF(R158<'Grading Scale'!G$8,IF(R158<'Grading Scale'!G$13,'Grading Scale'!E$13,IF(R158<'Grading Scale'!G$12,'Grading Scale'!E$11,IF(R158<'Grading Scale'!G$11,'Grading Scale'!E$9,IF(R158<'Grading Scale'!G$10,'Grading Scale'!E$7,IF(R158<'Grading Scale'!G$9,'Grading Scale'!E$5,'Grading Scale'!E$3))))),IF(R158<'Grading Scale'!G$7,'Grading Scale'!B$13,IF(R158<'Grading Scale'!G$6,'Grading Scale'!B$11,IF(R158<'Grading Scale'!G$5,'Grading Scale'!B$9,IF(R158<'Grading Scale'!G$4,'Grading Scale'!B$7,IF(R158<'Grading Scale'!G$3,'Grading Scale'!B$5,'Grading Scale'!B$3))))))","v":3},{"$f":"Scores!B149","v":0},{"$f":"IF(S158>='Grading Scale'!B$13,IF(S158='Grading Scale'!B$3,'Grading Scale'!C$3,IF(S158='Grading Scale'!B$5,'Grading Scale'!C$5,IF(S158='Grading Scale'!B$7,'Grading Scale'!C$7,IF(S158='Grading Scale'!B$9,'Grading Scale'!C$9,IF(S158='Grading Scale'!B$11,'Grading Scale'!C$11,'Grading Scale'!C$13))))),IF(S158='Grading Scale'!E$3,'Grading Scale'!F$3,IF(S158='Grading Scale'!E$5,'Grading Scale'!F$5,IF(S158='Grading Scale'!E$7,'Grading Scale'!F$7,IF(S158='Grading Scale'!E$9,'Grading Scale'!F$9,IF(S158='Grading Scale'!E$11,'Grading Scale'!F$11,'Grading Scale'!F$13))))))","v":"B    "}," ",null,""]
[{"$f":"Scores!A150","v":0},{"$f":"Scores!B150","v":0},{"$f":"Scores!C150","v":0},{"$f":"Scores!D150","v":0},{"$f":"Scores!E150","v":0},{"$f":"Scores!F150","v":0},{"$f":"Scores!G150","v":0},{"$f":"Scores!H150","v":0},{"$f":"Scores!I150","v":0},{"$f":"Scores!J150","v":0},{"$f":"Scores!K150","v":0},{"$f":"Scores!L150","v":0},{"$f":"Scores!M150","v":0},{"$f":"Scores!N150","v":0},{"$f":"Scores!O150","v":0},-0.70710678118654746,2.9512994231491119,2.9512994231491119,{"$f":"IF(R159<'Grading Scale'!G$8,IF(R159<'Grading Scale'!G$13,'Grading Scale'!E$13,IF(R159<'Grading Scale'!G$12,'Grading Scale'!E$11,IF(R159<'Grading Scale'!G$11,'Grading Scale'!E$9,IF(R159<'Grading Scale'!G$10,'Grading Scale'!E$7,IF(R159<'Grading Scale'!G$9,'Grading Scale'!E$5,'Grading Scale'!E$3))))),IF(R159<'Grading Scale'!G$7,'Grading Scale'!B$13,IF(R159<'Grading Scale'!G$6,'Grading Scale'!B$11,IF(R159<'Grading Scale'!G$5,'Grading Scale'!B$9,IF(R159<'Grading Scale'!G$4,'Grading Scale'!B$7,IF(R159<'Grading Scale'!G$3,'Grading Scale'!B$5,'Grading Scale'!B$3))))))","v":3},{"$f":"Scores!B150","v":0},{"$f":"IF(S159>='Grading Scale'!B$13,IF(S159='Grading Scale'!B$3,'Grading Scale'!C$3,IF(S159='Grading Scale'!B$5,'Grading Scale'!C$5,IF(S159='Grading Scale'!B$7,'Grading Scale'!C$7,IF(S159='Grading Scale'!B$9,'Grading Scale'!C$9,IF(S159='Grading Scale'!B$11,'Grading Scale'!C$11,'Grading Scale'!C$13))))),IF(S159='Grading Scale'!E$3,'Grading Scale'!F$3,IF(S159='Grading Scale'!E$5,'Grading Scale'!F$5,IF(S159='Grading Scale'!E$7,'Grading Scale'!F$7,IF(S159='Grading Scale'!E$9,'Grading Scale'!F$9,IF(S159='Grading Scale'!E$11,'Grading Scale'!F$11,'Grading Scale'!F$13))))))","v":"B    "}," ",null,""]
[{"$f":"Scores!A151","v":0},{"$f":"Scores!B151","v":0},{"$f":"Scores!C151","v":0},{"$f":"Scores!D151","v":0},{"$f":"Scores!E151","v":0},{"$f":"Scores!F151","v":0},{"$f":"Scores!G151","v":0},{"$f":"Scores!H151","v":0},{"$f":"Scores!I151","v":0},{"$f":"Scores!J151","v":0},{"$f":"Scores!K151","v":0},{"$f":"Scores!L151","v":0},{"$f":"Scores!M151","v":0},{"$f":"Scores!N151","v":0},{"$f":"Scores!O151","v":0},-0.70710678118654746,2.9512994231491119,2.9512994231491119,{"$f":"IF(R160<'Grading Scale'!G$8,IF(R160<'Grading Scale'!G$13,'Grading Scale'!E$13,IF(R160<'Grading Scale'!G$12,'Grading Scale'!E$11,IF(R160<'Grading Scale'!G$11,'Grading Scale'!E$9,IF(R160<'Grading Scale'!G$10,'Grading Scale'!E$7,IF(R160<'Grading Scale'!G$9,'Grading Scale'!E$5,'Grading Scale'!E$3))))),IF(R160<'Grading Scale'!G$7,'Grading Scale'!B$13,IF(R160<'Grading Scale'!G$6,'Grading Scale'!B$11,IF(R160<'Grading Scale'!G$5,'Grading Scale'!B$9,IF(R160<'Grading Scale'!G$4,'Grading Scale'!B$7,IF(R160<'Grading Scale'!G$3,'Grading Scale'!B$5,'Grading Scale'!B$3))))))","v":3},{"$f":"Scores!B151","v":0},{"$f":"IF(S160>='Grading Scale'!B$13,IF(S160='Grading Scale'!B$3,'Grading Scale'!C$3,IF(S160='Grading Scale'!B$5,'Grading Scale'!C$5,IF(S160='Grading Scale'!B$7,'Grading Scale'!C$7,IF(S160='Grading Scale'!B$9,'Grading Scale'!C$9,IF(S160='Grading Scale'!B$11,'Grading Scale'!C$11,'Grading Scale'!C$13))))),IF(S160='Grading Scale'!E$3,'Grading Scale'!F$3,IF(S160='Grading Scale'!E$5,'Grading Scale'!F$5,IF(S160='Grading Scale'!E$7,'Grading Scale'!F$7,IF(S160='Grading Scale'!E$9,'Grading Scale'!F$9,IF(S160='Grading Scale'!E$11,'Grading Scale'!F$11,'Grading Scale'!F$13))))))","v":"B    "}," ",null,""]
[{"$f":"Scores!A152","v":0},{"$f":"Scores!B152","v":0},{"$f":"Scores!C152","v":0},{"$f":"Scores!D152","v":0},{"$f":"Scores!E152","v":0},{"$f":"Scores!F152","v":0},{"$f":"Scores!G152","v":0},{"$f":"Scores!H152","v":0},{"$f":"Scores!I152","v":0},{"$f":"Scores!J152","v":0},{"$f":"Scores!K152","v":0},{"$f":"Scores!L152","v":0},{"$f":"Scores!M152","v":0},{"$f":"Scores!N152","v":0},{"$f":"Scores!O152","v":0},-0.70710678118654746,2.9512994231491119,2.9512994231491119,{"$f":"IF(R161<'Grading Scale'!G$8,IF(R161<'Grading Scale'!G$13,'Grading Scale'!E$13,IF(R161<'Grading Scale'!G$12,'Grading Scale'!E$11,IF(R161<'Grading Scale'!G$11,'Grading Scale'!E$9,IF(R161<'Grading Scale'!G$10,'Grading Scale'!E$7,IF(R161<'Grading Scale'!G$9,'Grading Scale'!E$5,'Grading Scale'!E$3))))),IF(R161<'Grading Scale'!G$7,'Grading Scale'!B$13,IF(R161<'Grading Scale'!G$6,'Grading Scale'!B$11,IF(R161<'Grading Scale'!G$5,'Grading Scale'!B$9,IF(R161<'Grading Scale'!G$4,'Grading Scale'!B$7,IF(R161<'Grading Scale'!G$3,'Grading Scale'!B$5,'Grading Scale'!B$3))))))","v":3},{"$f":"Scores!B152","v":0},{"$f":"IF(S161>='Grading Scale'!B$13,IF(S161='Grading Scale'!B$3,'Grading Scale'!C$3,IF(S161='Grading Scale'!B$5,'Grading Scale'!C$5,IF(S161='Grading Scale'!B$7,'Grading Scale'!C$7,IF(S161='Grading Scale'!B$9,'Grading Scale'!C$9,IF(S161='Grading Scale'!B$11,'Grading Scale'!C$11,'Grading Scale'!C$13))))),IF(S161='Grading Scale'!E$3,'Grading Scale'!F$3,IF(S161='Grading Scale'!E$5,'Grading Scale'!F$5,IF(S161='Grading Scale'!E$7,'Grading Scale'!F$7,IF(S161='Grading Scale'!E$9,'Grading Scale'!F$9,IF(S161='Grading Scale'!E$11,'Grading Scale'!F$11,'Grading Scale'!F$13))))))","v":"B    "}," ",null,""]
[{"$f":"Scores!A153","v":0},{"$f":"Scores!B153","v":0},{"$f":"Scores!C153","v":0},{"$f":"Scores!D153","v":0},{"$f":"Scores!E153","v":0},{"$f":"Scores!F153","v":0},{"$f":"Scores!G153","v":0},{"$f":"Scores!H153","v":0},{"$f":"Scores!I153","v":0},{"$f":"Scores!J153","v":0},{"$f":"Scores!K153","v":0},{"$f":"Scores!L153","v":0},{"$f":"Scores!M153","v":0},{"$f":"Scores!N153","v":0},{"$f":"Scores!O153","v":0},-0.70710678118654746,2.9512994231491119,2.9512994231491119,{"$f":"IF(R162<'Grading Scale'!G$8,IF(R162<'Grading Scale'!G$13,'Grading Scale'!E$13,IF(R162<'Grading Scale'!G$12,'Grading Scale'!E$11,IF(R162<'Grading Scale'!G$11,'Grading Scale'!E$9,IF(R162<'Grading Scale'!G$10,'Grading Scale'!E$7,IF(R162<'Grading Scale'!G$9,'Grading Scale'!E$5,'Grading Scale'!E$3))))),IF(R162<'Grading Scale'!G$7,'Grading Scale'!B$13,IF(R162<'Grading Scale'!G$6,'Grading Scale'!B$11,IF(R162<'Grading Scale'!G$5,'Grading Scale'!B$9,IF(R162<'Grading Scale'!G$4,'Grading Scale'!B$7,IF(R162<'Grading Scale'!G$3,'Grading Scale'!B$5,'Grading Scale'!B$3))))))","v":3},{"$f":"Scores!B153","v":0},{"$f":"IF(S162>='Grading Scale'!B$13,IF(S162='Grading Scale'!B$3,'Grading Scale'!C$3,IF(S162='Grading Scale'!B$5,'Grading Scale'!C$5,IF(S162='Grading Scale'!B$7,'Grading Scale'!C$7,IF(S162='Grading Scale'!B$9,'Grading Scale'!C$9,IF(S162='Grading Scale'!B$11,'Grading Scale'!C$11,'Grading Scale'!C$13))))),IF(S162='Grading Scale'!E$3,'Grading Scale'!F$3,IF(S162='Grading Scale'!E$5,'Grading Scale'!F$5,IF(S162='Grading Scale'!E$7,'Grading Scale'!F$7,IF(S162='Grading Scale'!E$9,'Grading Scale'!F$9,IF(S162='Grading Scale'!E$11,'Grading Scale'!F$11,'Grading Scale'!F$13))))))","v":"B    "}," ",null,""]
[{"$f":"Scores!A154","v":0},{"$f":"Scores!B154","v":0},{"$f":"Scores!C154","v":0},{"$f":"Scores!D154","v":0},{"$f":"Scores!E154","v":0},{"$f":"Scores!F154","v":0},{"$f":"Scores!G154","v":0},{"$f":"Scores!H154","v":0},{"$f":"Scores!I154","v":0},{"$f":"Scores!J154","v":0},{"$f":"Scores!K154","v":0},{"$f":"Scores!L154","v":0},{"$f":"Scores!M154","v":0},{"$f":"Scores!N154","v":0},{"$f":"Scores!O154","v":0},-0.70710678118654746,2.9512994231491119,2.9512994231491119,{"$f":"IF(R163<'Grading Scale'!G$8,IF(R163<'Grading Scale'!G$13,'Grading Scale'!E$13,IF(R163<'Grading Scale'!G$12,'Grading Scale'!E$11,IF(R163<'Grading Scale'!G$11,'Grading Scale'!E$9,IF(R163<'Grading Scale'!G$10,'Grading Scale'!E$7,IF(R163<'Grading Scale'!G$9,'Grading Scale'!E$5,'Grading Scale'!E$3))))),IF(R163<'Grading Scale'!G$7,'Grading Scale'!B$13,IF(R163<'Grading Scale'!G$6,'Grading Scale'!B$11,IF(R163<'Grading Scale'!G$5,'Grading Scale'!B$9,IF(R163<'Grading Scale'!G$4,'Grading Scale'!B$7,IF(R163<'Grading Scale'!G$3,'Grading Scale'!B$5,'Grading Scale'!B$3))))))","v":3},{"$f":"Scores!B154","v":0},{"$f":"IF(S163>='Grading Scale'!B$13,IF(S163='Grading Scale'!B$3,'Grading Scale'!C$3,IF(S163='Grading Scale'!B$5,'Grading Scale'!C$5,IF(S163='Grading Scale'!B$7,'Grading Scale'!C$7,IF(S163='Grading Scale'!B$9,'Grading Scale'!C$9,IF(S163='Grading Scale'!B$11,'Grading Scale'!C$11,'Grading Scale'!C$13))))),IF(S163='Grading Scale'!E$3,'Grading Scale'!F$3,IF(S163='Grading Scale'!E$5,'Grading Scale'!F$5,IF(S163='Grading Scale'!E$7,'Grading Scale'!F$7,IF(S163='Grading Scale'!E$9,'Grading Scale'!F$9,IF(S163='Grading Scale'!E$11,'Grading Scale'!F$11,'Grading Scale'!F$13))))))","v":"B    "}," ",null,""]
[{"$f":"Scores!A155","v":0},{"$f":"Scores!B155","v":0},{"$f":"Scores!C155","v":0},{"$f":"Scores!D155","v":0},{"$f":"Scores!E155","v":0},{"$f":"Scores!F155","v":0},{"$f":"Scores!G155","v":0},{"$f":"Scores!H155","v":0},{"$f":"Scores!I155","v":0},{"$f":"Scores!J155","v":0},{"$f":"Scores!K155","v":0},{"$f":"Scores!L155","v":0},{"$f":"Scores!M155","v":0},{"$f":"Scores!N155","v":0},{"$f":"Scores!O155","v":0},-0.70710678118654746,2.9512994231491119,2.9512994231491119,{"$f":"IF(R164<'Grading Scale'!G$8,IF(R164<'Grading Scale'!G$13,'Grading Scale'!E$13,IF(R164<'Grading Scale'!G$12,'Grading Scale'!E$11,IF(R164<'Grading Scale'!G$11,'Grading Scale'!E$9,IF(R164<'Grading Scale'!G$10,'Grading Scale'!E$7,IF(R164<'Grading Scale'!G$9,'Grading Scale'!E$5,'Grading Scale'!E$3))))),IF(R164<'Grading Scale'!G$7,'Grading Scale'!B$13,IF(R164<'Grading Scale'!G$6,'Grading Scale'!B$11,IF(R164<'Grading Scale'!G$5,'Grading Scale'!B$9,IF(R164<'Grading Scale'!G$4,'Grading Scale'!B$7,IF(R164<'Grading Scale'!G$3,'Grading Scale'!B$5,'Grading Scale'!B$3))))))","v":3},{"$f":"Scores!B155","v":0},{"$f":"IF(S164>='Grading Scale'!B$13,IF(S164='Grading Scale'!B$3,'Grading Scale'!C$3,IF(S164='Grading Scale'!B$5,'Grading Scale'!C$5,IF(S164='Grading Scale'!B$7,'Grading Scale'!C$7,IF(S164='Grading Scale'!B$9,'Grading Scale'!C$9,IF(S164='Grading Scale'!B$11,'Grading Scale'!C$11,'Grading Scale'!C$13))))),IF(S164='Grading Scale'!E$3,'Grading Scale'!F$3,IF(S164='Grading Scale'!E$5,'Grading Scale'!F$5,IF(S164='Grading Scale'!E$7,'Grading Scale'!F$7,IF(S164='Grading Scale'!E$9,'Grading Scale'!F$9,IF(S164='Grading Scale'!E$11,'Grading Scale'!F$11,'Grading Scale'!F$13))))))","v":"B    "}," ",null,""]
[{"$f":"Scores!A156","v":0},{"$f":"Scores!B156","v":0},{"$f":"Scores!C156","v":0},{"$f":"Scores!D156","v":0},{"$f":"Scores!E156","v":0},{"$f":"Scores!F156","v":0},{"$f":"Scores!G156","v":0},{"$f":"Scores!H156","v":0},{"$f":"Scores!I156","v":0},{"$f":"Scores!J156","v":0},{"$f":"Scores!K156","v":0},{"$f":"Scores!L156","v":0},{"$f":"Scores!M156","v":0},{"$f":"Scores!N156","v":0},{"$f":"Scores!O156","v":0},-0.70710678118654746,2.9512994231491119,2.9512994231491119,{"$f":"IF(R165<'Grading Scale'!G$8,IF(R165<'Grading Scale'!G$13,'Grading Scale'!E$13,IF(R165<'Grading Scale'!G$12,'Grading Scale'!E$11,IF(R165<'Grading Scale'!G$11,'Grading Scale'!E$9,IF(R165<'Grading Scale'!G$10,'Grading Scale'!E$7,IF(R165<'Grading Scale'!G$9,'Grading Scale'!E$5,'Grading Scale'!E$3))))),IF(R165<'Grading Scale'!G$7,'Grading Scale'!B$13,IF(R165<'Grading Scale'!G$6,'Grading Scale'!B$11,IF(R165<'Grading Scale'!G$5,'Grading Scale'!B$9,IF(R165<'Grading Scale'!G$4,'Grading Scale'!B$7,IF(R165<'Grading Scale'!G$3,'Grading Scale'!B$5,'Grading Scale'!B$3))))))","v":3},{"$f":"Scores!B156","v":0},{"$f":"IF(S165>='Grading Scale'!B$13,IF(S165='Grading Scale'!B$3,'Grading Scale'!C$3,IF(S165='Grading Scale'!B$5,'Grading Scale'!C$5,IF(S165='Grading Scale'!B$7,'Grading Scale'!C$7,IF(S165='Grading Scale'!B$9,'Grading Scale'!C$9,IF(S165='Grading Scale'!B$11,'Grading Scale'!C$11,'Grading Scale'!C$13))))),IF(S165='Grading Scale'!E$3,'Grading Scale'!F$3,IF(S165='Grading Scale'!E$5,'Grading Scale'!F$5,IF(S165='Grading Scale'!E$7,'Grading Scale'!F$7,IF(S165='Grading Scale'!E$9,'Grading Scale'!F$9,IF(S165='Grading Scale'!E$11,'Grading Scale'!F$11,'Grading Scale'!F$13))))))","v":"B    "}," ",null,""]
[{"$f":"Scores!A157","v":0},{"$f":"Scores!B157","v":0},{"$f":"Scores!C157","v":0},{"$f":"Scores!D157","v":0},{"$f":"Scores!E157","v":0},{"$f":"Scores!F157","v":0},{"$f":"Scores!G157","v":0},{"$f":"Scores!H157","v":0},{"$f":"Scores!I157","v":0},{"$f":"Scores!J157","v":0},{"$f":"Scores!K157","v":0},{"$f":"Scores!L157","v":0},{"$f":"Scores!M157","v":0},{"$f":"Scores!N157","v":0},{"$f":"Scores!O157","v":0},-0.70710678118654746,2.9512994231491119,2.9512994231491119,{"$f":"IF(R166<'Grading Scale'!G$8,IF(R166<'Grading Scale'!G$13,'Grading Scale'!E$13,IF(R166<'Grading Scale'!G$12,'Grading Scale'!E$11,IF(R166<'Grading Scale'!G$11,'Grading Scale'!E$9,IF(R166<'Grading Scale'!G$10,'Grading Scale'!E$7,IF(R166<'Grading Scale'!G$9,'Grading Scale'!E$5,'Grading Scale'!E$3))))),IF(R166<'Grading Scale'!G$7,'Grading Scale'!B$13,IF(R166<'Grading Scale'!G$6,'Grading Scale'!B$11,IF(R166<'Grading Scale'!G$5,'Grading Scale'!B$9,IF(R166<'Grading Scale'!G$4,'Grading Scale'!B$7,IF(R166<'Grading Scale'!G$3,'Grading Scale'!B$5,'Grading Scale'!B$3))))))","v":3},{"$f":"Scores!B157","v":0},{"$f":"IF(S166>='Grading Scale'!B$13,IF(S166='Grading Scale'!B$3,'Grading Scale'!C$3,IF(S166='Grading Scale'!B$5,'Grading Scale'!C$5,IF(S166='Grading Scale'!B$7,'Grading Scale'!C$7,IF(S166='Grading Scale'!B$9,'Grading Scale'!C$9,IF(S166='Grading Scale'!B$11,'Grading Scale'!C$11,'Grading Scale'!C$13))))),IF(S166='Grading Scale'!E$3,'Grading Scale'!F$3,IF(S166='Grading Scale'!E$5,'Grading Scale'!F$5,IF(S166='Grading Scale'!E$7,'Grading Scale'!F$7,IF(S166='Grading Scale'!E$9,'Grading Scale'!F$9,IF(S166='Grading Scale'!E$11,'Grading Scale'!F$11,'Grading Scale'!F$13))))))","v":"B    "}," ",null,""]
[{"$f":"Scores!A158","v":0},{"$f":"Scores!B158","v":0},{"$f":"Scores!C158","v":0},{"$f":"Scores!D158","v":0},{"$f":"Scores!E158","v":0},{"$f":"Scores!F158","v":0},{"$f":"Scores!G158","v":0},{"$f":"Scores!H158","v":0},{"$f":"Scores!I158","v":0},{"$f":"Scores!J158","v":0},{"$f":"Scores!K158","v":0},{"$f":"Scores!L158","v":0},{"$f":"Scores!M158","v":0},{"$f":"Scores!N158","v":0},{"$f":"Scores!O158","v":0},-0.70710678118654746,2.9512994231491119,2.9512994231491119,{"$f":"IF(R167<'Grading Scale'!G$8,IF(R167<'Grading Scale'!G$13,'Grading Scale'!E$13,IF(R167<'Grading Scale'!G$12,'Grading Scale'!E$11,IF(R167<'Grading Scale'!G$11,'Grading Scale'!E$9,IF(R167<'Grading Scale'!G$10,'Grading Scale'!E$7,IF(R167<'Grading Scale'!G$9,'Grading Scale'!E$5,'Grading Scale'!E$3))))),IF(R167<'Grading Scale'!G$7,'Grading Scale'!B$13,IF(R167<'Grading Scale'!G$6,'Grading Scale'!B$11,IF(R167<'Grading Scale'!G$5,'Grading Scale'!B$9,IF(R167<'Grading Scale'!G$4,'Grading Scale'!B$7,IF(R167<'Grading Scale'!G$3,'Grading Scale'!B$5,'Grading Scale'!B$3))))))","v":3},{"$f":"Scores!B158","v":0},{"$f":"IF(S167>='Grading Scale'!B$13,IF(S167='Grading Scale'!B$3,'Grading Scale'!C$3,IF(S167='Grading Scale'!B$5,'Grading Scale'!C$5,IF(S167='Grading Scale'!B$7,'Grading Scale'!C$7,IF(S167='Grading Scale'!B$9,'Grading Scale'!C$9,IF(S167='Grading Scale'!B$11,'Grading Scale'!C$11,'Grading Scale'!C$13))))),IF(S167='Grading Scale'!E$3,'Grading Scale'!F$3,IF(S167='Grading Scale'!E$5,'Grading Scale'!F$5,IF(S167='Grading Scale'!E$7,'Grading Scale'!F$7,IF(S167='Grading Scale'!E$9,'Grading Scale'!F$9,IF(S167='Grading Scale'!E$11,'Grading Scale'!F$11,'Grading Scale'!F$13))))))","v":"B    "}," ",null,""]
[{"$f":"Scores!A159","v":0},{"$f":"Scores!B159","v":0},{"$f":"Scores!C159","v":0},{"$f":"Scores!D159","v":0},{"$f":"Scores!E159","v":0},{"$f":"Scores!F159","v":0},{"$f":"Scores!G159","v":0},{"$f":"Scores!H159","v":0},{"$f":"Scores!I159","v":0},{"$f":"Scores!J159","v":0},{"$f":"Scores!K159","v":0},{"$f":"Scores!L159","v":0},{"$f":"Scores!M159","v":0},{"$f":"Scores!N159","v":0},{"$f":"Scores!O159","v":0},-0.70710678118654746,2.9512994231491119,2.9512994231491119,{"$f":"IF(R168<'Grading Scale'!G$8,IF(R168<'Grading Scale'!G$13,'Grading Scale'!E$13,IF(R168<'Grading Scale'!G$12,'Grading Scale'!E$11,IF(R168<'Grading Scale'!G$11,'Grading Scale'!E$9,IF(R168<'Grading Scale'!G$10,'Grading Scale'!E$7,IF(R168<'Grading Scale'!G$9,'Grading Scale'!E$5,'Grading Scale'!E$3))))),IF(R168<'Grading Scale'!G$7,'Grading Scale'!B$13,IF(R168<'Grading Scale'!G$6,'Grading Scale'!B$11,IF(R168<'Grading Scale'!G$5,'Grading Scale'!B$9,IF(R168<'Grading Scale'!G$4,'Grading Scale'!B$7,IF(R168<'Grading Scale'!G$3,'Grading Scale'!B$5,'Grading Scale'!B$3))))))","v":3},{"$f":"Scores!B159","v":0},{"$f":"IF(S168>='Grading Scale'!B$13,IF(S168='Grading Scale'!B$3,'Grading Scale'!C$3,IF(S168='Grading Scale'!B$5,'Grading Scale'!C$5,IF(S168='Grading Scale'!B$7,'Grading Scale'!C$7,IF(S168='Grading Scale'!B$9,'Grading Scale'!C$9,IF(S168='Grading Scale'!B$11,'Grading Scale'!C$11,'Grading Scale'!C$13))))),IF(S168='Grading Scale'!E$3,'Grading Scale'!F$3,IF(S168='Grading Scale'!E$5,'Grading Scale'!F$5,IF(S168='Grading Scale'!E$7,'Grading Scale'!F$7,IF(S168='Grading Scale'!E$9,'Grading Scale'!F$9,IF(S168='Grading Scale'!E$11,'Grading Scale'!F$11,'Grading Scale'!F$13))))))","v":"B    "}," ",null,""]
[{"$f":"Scores!A160","v":0},{"$f":"Scores!B160","v":0},{"$f":"Scores!C160","v":0},{"$f":"Scores!D160","v":0},{"$f":"Scores!E160","v":0},{"$f":"Scores!F160","v":0},{"$f":"Scores!G160","v":0},{"$f":"Scores!H160","v":0},{"$f":"Scores!I160","v":0},{"$f":"Scores!J160","v":0},{"$f":"Scores!K160","v":0},{"$f":"Scores!L160","v":0},{"$f":"Scores!M160","v":0},{"$f":"Scores!N160","v":0},{"$f":"Scores!O160","v":0},-0.70710678118654746,2.9512994231491119,2.9512994231491119,{"$f":"IF(R169<'Grading Scale'!G$8,IF(R169<'Grading Scale'!G$13,'Grading Scale'!E$13,IF(R169<'Grading Scale'!G$12,'Grading Scale'!E$11,IF(R169<'Grading Scale'!G$11,'Grading Scale'!E$9,IF(R169<'Grading Scale'!G$10,'Grading Scale'!E$7,IF(R169<'Grading Scale'!G$9,'Grading Scale'!E$5,'Grading Scale'!E$3))))),IF(R169<'Grading Scale'!G$7,'Grading Scale'!B$13,IF(R169<'Grading Scale'!G$6,'Grading Scale'!B$11,IF(R169<'Grading Scale'!G$5,'Grading Scale'!B$9,IF(R169<'Grading Scale'!G$4,'Grading Scale'!B$7,IF(R169<'Grading Scale'!G$3,'Grading Scale'!B$5,'Grading Scale'!B$3))))))","v":3},{"$f":"Scores!B160","v":0},{"$f":"IF(S169>='Grading Scale'!B$13,IF(S169='Grading Scale'!B$3,'Grading Scale'!C$3,IF(S169='Grading Scale'!B$5,'Grading Scale'!C$5,IF(S169='Grading Scale'!B$7,'Grading Scale'!C$7,IF(S169='Grading Scale'!B$9,'Grading Scale'!C$9,IF(S169='Grading Scale'!B$11,'Grading Scale'!C$11,'Grading Scale'!C$13))))),IF(S169='Grading Scale'!E$3,'Grading Scale'!F$3,IF(S169='Grading Scale'!E$5,'Grading Scale'!F$5,IF(S169='Grading Scale'!E$7,'Grading Scale'!F$7,IF(S169='Grading Scale'!E$9,'Grading Scale'!F$9,IF(S169='Grading Scale'!E$11,'Grading Scale'!F$11,'Grading Scale'!F$13))))))","v":"B    "}," ",null,""]
[{"$f":"Scores!A161","v":0},{"$f":"Scores!B161","v":0},{"$f":"Scores!C161","v":0},{"$f":"Scores!D161","v":0},{"$f":"Scores!E161","v":0},{"$f":"Scores!F161","v":0},{"$f":"Scores!G161","v":0},{"$f":"Scores!H161","v":0},{"$f":"Scores!I161","v":0},{"$f":"Scores!J161","v":0},{"$f":"Scores!K161","v":0},{"$f":"Scores!L161","v":0},{"$f":"Scores!M161","v":0},{"$f":"Scores!N161","v":0},{"$f":"Scores!O161","v":0},-0.70710678118654746,2.9512994231491119,2.9512994231491119,{"$f":"IF(R170<'Grading Scale'!G$8,IF(R170<'Grading Scale'!G$13,'Grading Scale'!E$13,IF(R170<'Grading Scale'!G$12,'Grading Scale'!E$11,IF(R170<'Grading Scale'!G$11,'Grading Scale'!E$9,IF(R170<'Grading Scale'!G$10,'Grading Scale'!E$7,IF(R170<'Grading Scale'!G$9,'Grading Scale'!E$5,'Grading Scale'!E$3))))),IF(R170<'Grading Scale'!G$7,'Grading Scale'!B$13,IF(R170<'Grading Scale'!G$6,'Grading Scale'!B$11,IF(R170<'Grading Scale'!G$5,'Grading Scale'!B$9,IF(R170<'Grading Scale'!G$4,'Grading Scale'!B$7,IF(R170<'Grading Scale'!G$3,'Grading Scale'!B$5,'Grading Scale'!B$3))))))","v":3},{"$f":"Scores!B161","v":0},{"$f":"IF(S170>='Grading Scale'!B$13,IF(S170='Grading Scale'!B$3,'Grading Scale'!C$3,IF(S170='Grading Scale'!B$5,'Grading Scale'!C$5,IF(S170='Grading Scale'!B$7,'Grading Scale'!C$7,IF(S170='Grading Scale'!B$9,'Grading Scale'!C$9,IF(S170='Grading Scale'!B$11,'Grading Scale'!C$11,'Grading Scale'!C$13))))),IF(S170='Grading Scale'!E$3,'Grading Scale'!F$3,IF(S170='Grading Scale'!E$5,'Grading Scale'!F$5,IF(S170='Grading Scale'!E$7,'Grading Scale'!F$7,IF(S170='Grading Scale'!E$9,'Grading Scale'!F$9,IF(S170='Grading Scale'!E$11,'Grading Scale'!F$11,'Grading Scale'!F$13))))))","v":"B    "}," ",null,""]
[{"$f":"Scores!A162","v":0},{"$f":"Scores!B162","v":0},{"$f":"Scores!C162","v":0},{"$f":"Scores!D162","v":0},{"$f":"Scores!E162","v":0},{"$f":"Scores!F162","v":0},{"$f":"Scores!G162","v":0},{"$f":"Scores!H162","v":0},{"$f":"Scores!I162","v":0},{"$f":"Scores!J162","v":0},{"$f":"Scores!K162","v":0},{"$f":"Scores!L162","v":0},{"$f":"Scores!M162","v":0},{"$f":"Scores!N162","v":0},{"$f":"Scores!O162","v":0},-0.70710678118654746,2.9512994231491119,2.9512994231491119,{"$f":"IF(R171<'Grading Scale'!G$8,IF(R171<'Grading Scale'!G$13,'Grading Scale'!E$13,IF(R171<'Grading Scale'!G$12,'Grading Scale'!E$11,IF(R171<'Grading Scale'!G$11,'Grading Scale'!E$9,IF(R171<'Grading Scale'!G$10,'Grading Scale'!E$7,IF(R171<'Grading Scale'!G$9,'Grading Scale'!E$5,'Grading Scale'!E$3))))),IF(R171<'Grading Scale'!G$7,'Grading Scale'!B$13,IF(R171<'Grading Scale'!G$6,'Grading Scale'!B$11,IF(R171<'Grading Scale'!G$5,'Grading Scale'!B$9,IF(R171<'Grading Scale'!G$4,'Grading Scale'!B$7,IF(R171<'Grading Scale'!G$3,'Grading Scale'!B$5,'Grading Scale'!B$3))))))","v":3},{"$f":"Scores!B162","v":0},{"$f":"IF(S171>='Grading Scale'!B$13,IF(S171='Grading Scale'!B$3,'Grading Scale'!C$3,IF(S171='Grading Scale'!B$5,'Grading Scale'!C$5,IF(S171='Grading Scale'!B$7,'Grading Scale'!C$7,IF(S171='Grading Scale'!B$9,'Grading Scale'!C$9,IF(S171='Grading Scale'!B$11,'Grading Scale'!C$11,'Grading Scale'!C$13))))),IF(S171='Grading Scale'!E$3,'Grading Scale'!F$3,IF(S171='Grading Scale'!E$5,'Grading Scale'!F$5,IF(S171='Grading Scale'!E$7,'Grading Scale'!F$7,IF(S171='Grading Scale'!E$9,'Grading Scale'!F$9,IF(S171='Grading Scale'!E$11,'Grading Scale'!F$11,'Grading Scale'!F$13))))))","v":"B    "}," ",null,""]
[{"$f":"Scores!A163","v":0},{"$f":"Scores!B163","v":0},{"$f":"Scores!C163","v":0},{"$f":"Scores!D163","v":0},{"$f":"Scores!E163","v":0},{"$f":"Scores!F163","v":0},{"$f":"Scores!G163","v":0},{"$f":"Scores!H163","v":0},{"$f":"Scores!I163","v":0},{"$f":"Scores!J163","v":0},{"$f":"Scores!K163","v":0},{"$f":"Scores!L163","v":0},{"$f":"Scores!M163","v":0},{"$f":"Scores!N163","v":0},{"$f":"Scores!O163","v":0},-0.70710678118654746,2.9512994231491119,2.9512994231491119,{"$f":"IF(R172<'Grading Scale'!G$8,IF(R172<'Grading Scale'!G$13,'Grading Scale'!E$13,IF(R172<'Grading Scale'!G$12,'Grading Scale'!E$11,IF(R172<'Grading Scale'!G$11,'Grading Scale'!E$9,IF(R172<'Grading Scale'!G$10,'Grading Scale'!E$7,IF(R172<'Grading Scale'!G$9,'Grading Scale'!E$5,'Grading Scale'!E$3))))),IF(R172<'Grading Scale'!G$7,'Grading Scale'!B$13,IF(R172<'Grading Scale'!G$6,'Grading Scale'!B$11,IF(R172<'Grading Scale'!G$5,'Grading Scale'!B$9,IF(R172<'Grading Scale'!G$4,'Grading Scale'!B$7,IF(R172<'Grading Scale'!G$3,'Grading Scale'!B$5,'Grading Scale'!B$3))))))","v":3},{"$f":"Scores!B163","v":0},{"$f":"IF(S172>='Grading Scale'!B$13,IF(S172='Grading Scale'!B$3,'Grading Scale'!C$3,IF(S172='Grading Scale'!B$5,'Grading Scale'!C$5,IF(S172='Grading Scale'!B$7,'Grading Scale'!C$7,IF(S172='Grading Scale'!B$9,'Grading Scale'!C$9,IF(S172='Grading Scale'!B$11,'Grading Scale'!C$11,'Grading Scale'!C$13))))),IF(S172='Grading Scale'!E$3,'Grading Scale'!F$3,IF(S172='Grading Scale'!E$5,'Grading Scale'!F$5,IF(S172='Grading Scale'!E$7,'Grading Scale'!F$7,IF(S172='Grading Scale'!E$9,'Grading Scale'!F$9,IF(S172='Grading Scale'!E$11,'Grading Scale'!F$11,'Grading Scale'!F$13))))))","v":"B    "}," ",null,""]
[{"$f":"Scores!A164","v":0},{"$f":"Scores!B164","v":0},{"$f":"Scores!C164","v":0},{"$f":"Scores!D164","v":0},{"$f":"Scores!E164","v":0},{"$f":"Scores!F164","v":0},{"$f":"Scores!G164","v":0},{"$f":"Scores!H164","v":0},{"$f":"Scores!I164","v":0},{"$f":"Scores!J164","v":0},{"$f":"Scores!K164","v":0},{"$f":"Scores!L164","v":0},{"$f":"Scores!M164","v":0},{"$f":"Scores!N164","v":0},{"$f":"Scores!O164","v":0},-0.70710678118654746,2.9512994231491119,2.9512994231491119,{"$f":"IF(R173<'Grading Scale'!G$8,IF(R173<'Grading Scale'!G$13,'Grading Scale'!E$13,IF(R173<'Grading Scale'!G$12,'Grading Scale'!E$11,IF(R173<'Grading Scale'!G$11,'Grading Scale'!E$9,IF(R173<'Grading Scale'!G$10,'Grading Scale'!E$7,IF(R173<'Grading Scale'!G$9,'Grading Scale'!E$5,'Grading Scale'!E$3))))),IF(R173<'Grading Scale'!G$7,'Grading Scale'!B$13,IF(R173<'Grading Scale'!G$6,'Grading Scale'!B$11,IF(R173<'Grading Scale'!G$5,'Grading Scale'!B$9,IF(R173<'Grading Scale'!G$4,'Grading Scale'!B$7,IF(R173<'Grading Scale'!G$3,'Grading Scale'!B$5,'Grading Scale'!B$3))))))","v":3},{"$f":"Scores!B164","v":0},{"$f":"IF(S173>='Grading Scale'!B$13,IF(S173='Grading Scale'!B$3,'Grading Scale'!C$3,IF(S173='Grading Scale'!B$5,'Grading Scale'!C$5,IF(S173='Grading Scale'!B$7,'Grading Scale'!C$7,IF(S173='Grading Scale'!B$9,'Grading Scale'!C$9,IF(S173='Grading Scale'!B$11,'Grading Scale'!C$11,'Grading Scale'!C$13))))),IF(S173='Grading Scale'!E$3,'Grading Scale'!F$3,IF(S173='Grading Scale'!E$5,'Grading Scale'!F$5,IF(S173='Grading Scale'!E$7,'Grading Scale'!F$7,IF(S173='Grading Scale'!E$9,'Grading Scale'!F$9,IF(S173='Grading Scale'!E$11,'Grading Scale'!F$11,'Grading Scale'!F$13))))))","v":"B    "}," ",null,""]
[{"$f":"Scores!A165","v":0},{"$f":"Scores!B165","v":0},{"$f":"Scores!C165","v":0},{"$f":"Scores!D165","v":0},{"$f":"Scores!E165","v":0},{"$f":"Scores!F165","v":0},{"$f":"Scores!G165","v":0},{"$f":"Scores!H165","v":0},{"$f":"Scores!I165","v":0},{"$f":"Scores!J165","v":0},{"$f":"Scores!K165","v":0},{"$f":"Scores!L165","v":0},{"$f":"Scores!M165","v":0},{"$f":"Scores!N165","v":0},{"$f":"Scores!O165","v":0},-0.70710678118654746,2.9512994231491119,2.9512994231491119,{"$f":"IF(R174<'Grading Scale'!G$8,IF(R174<'Grading Scale'!G$13,'Grading Scale'!E$13,IF(R174<'Grading Scale'!G$12,'Grading Scale'!E$11,IF(R174<'Grading Scale'!G$11,'Grading Scale'!E$9,IF(R174<'Grading Scale'!G$10,'Grading Scale'!E$7,IF(R174<'Grading Scale'!G$9,'Grading Scale'!E$5,'Grading Scale'!E$3))))),IF(R174<'Grading Scale'!G$7,'Grading Scale'!B$13,IF(R174<'Grading Scale'!G$6,'Grading Scale'!B$11,IF(R174<'Grading Scale'!G$5,'Grading Scale'!B$9,IF(R174<'Grading Scale'!G$4,'Grading Scale'!B$7,IF(R174<'Grading Scale'!G$3,'Grading Scale'!B$5,'Grading Scale'!B$3))))))","v":3},{"$f":"Scores!B165","v":0},{"$f":"IF(S174>='Grading Scale'!B$13,IF(S174='Grading Scale'!B$3,'Grading Scale'!C$3,IF(S174='Grading Scale'!B$5,'Grading Scale'!C$5,IF(S174='Grading Scale'!B$7,'Grading Scale'!C$7,IF(S174='Grading Scale'!B$9,'Grading Scale'!C$9,IF(S174='Grading Scale'!B$11,'Grading Scale'!C$11,'Grading Scale'!C$13))))),IF(S174='Grading Scale'!E$3,'Grading Scale'!F$3,IF(S174='Grading Scale'!E$5,'Grading Scale'!F$5,IF(S174='Grading Scale'!E$7,'Grading Scale'!F$7,IF(S174='Grading Scale'!E$9,'Grading Scale'!F$9,IF(S174='Grading Scale'!E$11,'Grading Scale'!F$11,'Grading Scale'!F$13))))))","v":"B    "}," ",null,""]
[{"$f":"Scores!A166","v":0},{"$f":"Scores!B166","v":0},{"$f":"Scores!C166","v":0},{"$f":"Scores!D166","v":0},{"$f":"Scores!E166","v":0},{"$f":"Scores!F166","v":0},{"$f":"Scores!G166","v":0},{"$f":"Scores!H166","v":0},{"$f":"Scores!I166","v":0},{"$f":"Scores!J166","v":0},{"$f":"Scores!K166","v":0},{"$f":"Scores!L166","v":0},{"$f":"Scores!M166","v":0},{"$f":"Scores!N166","v":0},{"$f":"Scores!O166","v":0},-0.70710678118654746,2.9512994231491119,2.9512994231491119,{"$f":"IF(R175<'Grading Scale'!G$8,IF(R175<'Grading Scale'!G$13,'Grading Scale'!E$13,IF(R175<'Grading Scale'!G$12,'Grading Scale'!E$11,IF(R175<'Grading Scale'!G$11,'Grading Scale'!E$9,IF(R175<'Grading Scale'!G$10,'Grading Scale'!E$7,IF(R175<'Grading Scale'!G$9,'Grading Scale'!E$5,'Grading Scale'!E$3))))),IF(R175<'Grading Scale'!G$7,'Grading Scale'!B$13,IF(R175<'Grading Scale'!G$6,'Grading Scale'!B$11,IF(R175<'Grading Scale'!G$5,'Grading Scale'!B$9,IF(R175<'Grading Scale'!G$4,'Grading Scale'!B$7,IF(R175<'Grading Scale'!G$3,'Grading Scale'!B$5,'Grading Scale'!B$3))))))","v":3},{"$f":"Scores!B166","v":0},{"$f":"IF(S175>='Grading Scale'!B$13,IF(S175='Grading Scale'!B$3,'Grading Scale'!C$3,IF(S175='Grading Scale'!B$5,'Grading Scale'!C$5,IF(S175='Grading Scale'!B$7,'Grading Scale'!C$7,IF(S175='Grading Scale'!B$9,'Grading Scale'!C$9,IF(S175='Grading Scale'!B$11,'Grading Scale'!C$11,'Grading Scale'!C$13))))),IF(S175='Grading Scale'!E$3,'Grading Scale'!F$3,IF(S175='Grading Scale'!E$5,'Grading Scale'!F$5,IF(S175='Grading Scale'!E$7,'Grading Scale'!F$7,IF(S175='Grading Scale'!E$9,'Grading Scale'!F$9,IF(S175='Grading Scale'!E$11,'Grading Scale'!F$11,'Grading Scale'!F$13))))))","v":"B    "}," ",null,""]
[{"$f":"Scores!A167","v":0},{"$f":"Scores!B167","v":0},{"$f":"Scores!C167","v":0},{"$f":"Scores!D167","v":0},{"$f":"Scores!E167","v":0},{"$f":"Scores!F167","v":0},{"$f":"Scores!G167","v":0},{"$f":"Scores!H167","v":0},{"$f":"Scores!I167","v":0},{"$f":"Scores!J167","v":0},{"$f":"Scores!K167","v":0},{"$f":"Scores!L167","v":0},{"$f":"Scores!M167","v":0},{"$f":"Scores!N167","v":0},{"$f":"Scores!O167","v":0},-0.70710678118654746,2.9512994231491119,2.9512994231491119,{"$f":"IF(R176<'Grading Scale'!G$8,IF(R176<'Grading Scale'!G$13,'Grading Scale'!E$13,IF(R176<'Grading Scale'!G$12,'Grading Scale'!E$11,IF(R176<'Grading Scale'!G$11,'Grading Scale'!E$9,IF(R176<'Grading Scale'!G$10,'Grading Scale'!E$7,IF(R176<'Grading Scale'!G$9,'Grading Scale'!E$5,'Grading Scale'!E$3))))),IF(R176<'Grading Scale'!G$7,'Grading Scale'!B$13,IF(R176<'Grading Scale'!G$6,'Grading Scale'!B$11,IF(R176<'Grading Scale'!G$5,'Grading Scale'!B$9,IF(R176<'Grading Scale'!G$4,'Grading Scale'!B$7,IF(R176<'Grading Scale'!G$3,'Grading Scale'!B$5,'Grading Scale'!B$3))))))","v":3},{"$f":"Scores!B167","v":0},{"$f":"IF(S176>='Grading Scale'!B$13,IF(S176='Grading Scale'!B$3,'Grading Scale'!C$3,IF(S176='Grading Scale'!B$5,'Grading Scale'!C$5,IF(S176='Grading Scale'!B$7,'Grading Scale'!C$7,IF(S176='Grading Scale'!B$9,'Grading Scale'!C$9,IF(S176='Grading Scale'!B$11,'Grading Scale'!C$11,'Grading Scale'!C$13))))),IF(S176='Grading Scale'!E$3,'Grading Scale'!F$3,IF(S176='Grading Scale'!E$5,'Grading Scale'!F$5,IF(S176='Grading Scale'!E$7,'Grading Scale'!F$7,IF(S176='Grading Scale'!E$9,'Grading Scale'!F$9,IF(S176='Grading Scale'!E$11,'Grading Scale'!F$11,'Grading Scale'!F$13))))))","v":"B    "}," ",null,""]
[{"$f":"Scores!A168","v":0},{"$f":"Scores!B168","v":0},{"$f":"Scores!C168","v":0},{"$f":"Scores!D168","v":0},{"$f":"Scores!E168","v":0},{"$f":"Scores!F168","v":0},{"$f":"Scores!G168","v":0},{"$f":"Scores!H168","v":0},{"$f":"Scores!I168","v":0},{"$f":"Scores!J168","v":0},{"$f":"Scores!K168","v":0},{"$f":"Scores!L168","v":0},{"$f":"Scores!M168","v":0},{"$f":"Scores!N168","v":0},{"$f":"Scores!O168","v":0},-0.70710678118654746,2.9512994231491119,2.9512994231491119,{"$f":"IF(R177<'Grading Scale'!G$8,IF(R177<'Grading Scale'!G$13,'Grading Scale'!E$13,IF(R177<'Grading Scale'!G$12,'Grading Scale'!E$11,IF(R177<'Grading Scale'!G$11,'Grading Scale'!E$9,IF(R177<'Grading Scale'!G$10,'Grading Scale'!E$7,IF(R177<'Grading Scale'!G$9,'Grading Scale'!E$5,'Grading Scale'!E$3))))),IF(R177<'Grading Scale'!G$7,'Grading Scale'!B$13,IF(R177<'Grading Scale'!G$6,'Grading Scale'!B$11,IF(R177<'Grading Scale'!G$5,'Grading Scale'!B$9,IF(R177<'Grading Scale'!G$4,'Grading Scale'!B$7,IF(R177<'Grading Scale'!G$3,'Grading Scale'!B$5,'Grading Scale'!B$3))))))","v":3},{"$f":"Scores!B168","v":0},{"$f":"IF(S177>='Grading Scale'!B$13,IF(S177='Grading Scale'!B$3,'Grading Scale'!C$3,IF(S177='Grading Scale'!B$5,'Grading Scale'!C$5,IF(S177='Grading Scale'!B$7,'Grading Scale'!C$7,IF(S177='Grading Scale'!B$9,'Grading Scale'!C$9,IF(S177='Grading Scale'!B$11,'Grading Scale'!C$11,'Grading Scale'!C$13))))),IF(S177='Grading Scale'!E$3,'Grading Scale'!F$3,IF(S177='Grading Scale'!E$5,'Grading Scale'!F$5,IF(S177='Grading Scale'!E$7,'Grading Scale'!F$7,IF(S177='Grading Scale'!E$9,'Grading Scale'!F$9,IF(S177='Grading Scale'!E$11,'Grading Scale'!F$11,'Grading Scale'!F$13))))))","v":"B    "}," ",null,""]
[{"$f":"Scores!A169","v":0},{"$f":"Scores!B169","v":0},{"$f":"Scores!C169","v":0},{"$f":"Scores!D169","v":0},{"$f":"Scores!E169","v":0},{"$f":"Scores!F169","v":0},{"$f":"Scores!G169","v":0},{"$f":"Scores!H169","v":0},{"$f":"Scores!I169","v":0},{"$f":"Scores!J169","v":0},{"$f":"Scores!K169","v":0},{"$f":"Scores!L169","v":0},{"$f":"Scores!M169","v":0},{"$f":"Scores!N169","v":0},{"$f":"Scores!O169","v":0},-0.70710678118654746,2.9512994231491119,2.9512994231491119,{"$f":"IF(R178<'Grading Scale'!G$8,IF(R178<'Grading Scale'!G$13,'Grading Scale'!E$13,IF(R178<'Grading Scale'!G$12,'Grading Scale'!E$11,IF(R178<'Grading Scale'!G$11,'Grading Scale'!E$9,IF(R178<'Grading Scale'!G$10,'Grading Scale'!E$7,IF(R178<'Grading Scale'!G$9,'Grading Scale'!E$5,'Grading Scale'!E$3))))),IF(R178<'Grading Scale'!G$7,'Grading Scale'!B$13,IF(R178<'Grading Scale'!G$6,'Grading Scale'!B$11,IF(R178<'Grading Scale'!G$5,'Grading Scale'!B$9,IF(R178<'Grading Scale'!G$4,'Grading Scale'!B$7,IF(R178<'Grading Scale'!G$3,'Grading Scale'!B$5,'Grading Scale'!B$3))))))","v":3},{"$f":"Scores!B169","v":0},{"$f":"IF(S178>='Grading Scale'!B$13,IF(S178='Grading Scale'!B$3,'Grading Scale'!C$3,IF(S178='Grading Scale'!B$5,'Grading Scale'!C$5,IF(S178='Grading Scale'!B$7,'Grading Scale'!C$7,IF(S178='Grading Scale'!B$9,'Grading Scale'!C$9,IF(S178='Grading Scale'!B$11,'Grading Scale'!C$11,'Grading Scale'!C$13))))),IF(S178='Grading Scale'!E$3,'Grading Scale'!F$3,IF(S178='Grading Scale'!E$5,'Grading Scale'!F$5,IF(S178='Grading Scale'!E$7,'Grading Scale'!F$7,IF(S178='Grading Scale'!E$9,'Grading Scale'!F$9,IF(S178='Grading Scale'!E$11,'Grading Scale'!F$11,'Grading Scale'!F$13))))))","v":"B    "}," ",null,""]
[{"$f":"Scores!A170","v":0},{"$f":"Scores!B170","v":0},{"$f":"Scores!C170","v":0},{"$f":"Scores!D170","v":0},{"$f":"Scores!E170","v":0},{"$f":"Scores!F170","v":0},{"$f":"Scores!G170","v":0},{"$f":"Scores!H170","v":0},{"$f":"Scores!I170","v":0},{"$f":"Scores!J170","v":0},{"$f":"Scores!K170","v":0},{"$f":"Scores!L170","v":0},{"$f":"Scores!M170","v":0},{"$f":"Scores!N170","v":0},{"$f":"Scores!O170","v":0},-0.70710678118654746,2.9512994231491119,2.9512994231491119,{"$f":"IF(R179<'Grading Scale'!G$8,IF(R179<'Grading Scale'!G$13,'Grading Scale'!E$13,IF(R179<'Grading Scale'!G$12,'Grading Scale'!E$11,IF(R179<'Grading Scale'!G$11,'Grading Scale'!E$9,IF(R179<'Grading Scale'!G$10,'Grading Scale'!E$7,IF(R179<'Grading Scale'!G$9,'Grading Scale'!E$5,'Grading Scale'!E$3))))),IF(R179<'Grading Scale'!G$7,'Grading Scale'!B$13,IF(R179<'Grading Scale'!G$6,'Grading Scale'!B$11,IF(R179<'Grading Scale'!G$5,'Grading Scale'!B$9,IF(R179<'Grading Scale'!G$4,'Grading Scale'!B$7,IF(R179<'Grading Scale'!G$3,'Grading Scale'!B$5,'Grading Scale'!B$3))))))","v":3},{"$f":"Scores!B170","v":0},{"$f":"IF(S179>='Grading Scale'!B$13,IF(S179='Grading Scale'!B$3,'Grading Scale'!C$3,IF(S179='Grading Scale'!B$5,'Grading Scale'!C$5,IF(S179='Grading Scale'!B$7,'Grading Scale'!C$7,IF(S179='Grading Scale'!B$9,'Grading Scale'!C$9,IF(S179='Grading Scale'!B$11,'Grading Scale'!C$11,'Grading Scale'!C$13))))),IF(S179='Grading Scale'!E$3,'Grading Scale'!F$3,IF(S179='Grading Scale'!E$5,'Grading Scale'!F$5,IF(S179='Grading Scale'!E$7,'Grading Scale'!F$7,IF(S179='Grading Scale'!E$9,'Grading Scale'!F$9,IF(S179='Grading Scale'!E$11,'Grading Scale'!F$11,'Grading Scale'!F$13))))))","v":"B    "}," ",null,""]
[{"$f":"Scores!A171","v":0},{"$f":"Scores!B171","v":0},{"$f":"Scores!C171","v":0},{"$f":"Scores!D171","v":0},{"$f":"Scores!E171","v":0},{"$f":"Scores!F171","v":0},{"$f":"Scores!G171","v":0},{"$f":"Scores!H171","v":0},{"$f":"Scores!I171","v":0},{"$f":"Scores!J171","v":0},{"$f":"Scores!K171","v":0},{"$f":"Scores!L171","v":0},{"$f":"Scores!M171","v":0},{"$f":"Scores!N171","v":0},{"$f":"Scores!O171","v":0},-0.70710678118654746,2.9512994231491119,2.9512994231491119,{"$f":"IF(R180<'Grading Scale'!G$8,IF(R180<'Grading Scale'!G$13,'Grading Scale'!E$13,IF(R180<'Grading Scale'!G$12,'Grading Scale'!E$11,IF(R180<'Grading Scale'!G$11,'Grading Scale'!E$9,IF(R180<'Grading Scale'!G$10,'Grading Scale'!E$7,IF(R180<'Grading Scale'!G$9,'Grading Scale'!E$5,'Grading Scale'!E$3))))),IF(R180<'Grading Scale'!G$7,'Grading Scale'!B$13,IF(R180<'Grading Scale'!G$6,'Grading Scale'!B$11,IF(R180<'Grading Scale'!G$5,'Grading Scale'!B$9,IF(R180<'Grading Scale'!G$4,'Grading Scale'!B$7,IF(R180<'Grading Scale'!G$3,'Grading Scale'!B$5,'Grading Scale'!B$3))))))","v":3},{"$f":"Scores!B171","v":0},{"$f":"IF(S180>='Grading Scale'!B$13,IF(S180='Grading Scale'!B$3,'Grading Scale'!C$3,IF(S180='Grading Scale'!B$5,'Grading Scale'!C$5,IF(S180='Grading Scale'!B$7,'Grading Scale'!C$7,IF(S180='Grading Scale'!B$9,'Grading Scale'!C$9,IF(S180='Grading Scale'!B$11,'Grading Scale'!C$11,'Grading Scale'!C$13))))),IF(S180='Grading Scale'!E$3,'Grading Scale'!F$3,IF(S180='Grading Scale'!E$5,'Grading Scale'!F$5,IF(S180='Grading Scale'!E$7,'Grading Scale'!F$7,IF(S180='Grading Scale'!E$9,'Grading Scale'!F$9,IF(S180='Grading Scale'!E$11,'Grading Scale'!F$11,'Grading Scale'!F$13))))))","v":"B    "}," ",null,""]
[{"$f":"Scores!A172","v":0},{"$f":"Scores!B172","v":0},{"$f":"Scores!C172","v":0},{"$f":"Scores!D172","v":0},{"$f":"Scores!E172","v":0},{"$f":"Scores!F172","v":0},{"$f":"Scores!G172","v":0},{"$f":"Scores!H172","v":0},{"$f":"Scores!I172","v":0},{"$f":"Scores!J172","v":0},{"$f":"Scores!K172","v":0},{"$f":"Scores!L172","v":0},{"$f":"Scores!M172","v":0},{"$f":"Scores!N172","v":0},{"$f":"Scores!O172","v":0},-0.70710678118654746,2.9512994231491119,2.9512994231491119,{"$f":"IF(R181<'Grading Scale'!G$8,IF(R181<'Grading Scale'!G$13,'Grading Scale'!E$13,IF(R181<'Grading Scale'!G$12,'Grading Scale'!E$11,IF(R181<'Grading Scale'!G$11,'Grading Scale'!E$9,IF(R181<'Grading Scale'!G$10,'Grading Scale'!E$7,IF(R181<'Grading Scale'!G$9,'Grading Scale'!E$5,'Grading Scale'!E$3))))),IF(R181<'Grading Scale'!G$7,'Grading Scale'!B$13,IF(R181<'Grading Scale'!G$6,'Grading Scale'!B$11,IF(R181<'Grading Scale'!G$5,'Grading Scale'!B$9,IF(R181<'Grading Scale'!G$4,'Grading Scale'!B$7,IF(R181<'Grading Scale'!G$3,'Grading Scale'!B$5,'Grading Scale'!B$3))))))","v":3},{"$f":"Scores!B172","v":0},{"$f":"IF(S181>='Grading Scale'!B$13,IF(S181='Grading Scale'!B$3,'Grading Scale'!C$3,IF(S181='Grading Scale'!B$5,'Grading Scale'!C$5,IF(S181='Grading Scale'!B$7,'Grading Scale'!C$7,IF(S181='Grading Scale'!B$9,'Grading Scale'!C$9,IF(S181='Grading Scale'!B$11,'Grading Scale'!C$11,'Grading Scale'!C$13))))),IF(S181='Grading Scale'!E$3,'Grading Scale'!F$3,IF(S181='Grading Scale'!E$5,'Grading Scale'!F$5,IF(S181='Grading Scale'!E$7,'Grading Scale'!F$7,IF(S181='Grading Scale'!E$9,'Grading Scale'!F$9,IF(S181='Grading Scale'!E$11,'Grading Scale'!F$11,'Grading Scale'!F$13))))))","v":"B    "}," ",null,""]
[{"$f":"Scores!A173","v":0},{"$f":"Scores!B173","v":0},{"$f":"Scores!C173","v":0},{"$f":"Scores!D173","v":0},{"$f":"Scores!E173","v":0},{"$f":"Scores!F173","v":0},{"$f":"Scores!G173","v":0},{"$f":"Scores!H173","v":0},{"$f":"Scores!I173","v":0},{"$f":"Scores!J173","v":0},{"$f":"Scores!K173","v":0},{"$f":"Scores!L173","v":0},{"$f":"Scores!M173","v":0},{"$f":"Scores!N173","v":0},{"$f":"Scores!O173","v":0},-0.70710678118654746,2.9512994231491119,2.9512994231491119,{"$f":"IF(R182<'Grading Scale'!G$8,IF(R182<'Grading Scale'!G$13,'Grading Scale'!E$13,IF(R182<'Grading Scale'!G$12,'Grading Scale'!E$11,IF(R182<'Grading Scale'!G$11,'Grading Scale'!E$9,IF(R182<'Grading Scale'!G$10,'Grading Scale'!E$7,IF(R182<'Grading Scale'!G$9,'Grading Scale'!E$5,'Grading Scale'!E$3))))),IF(R182<'Grading Scale'!G$7,'Grading Scale'!B$13,IF(R182<'Grading Scale'!G$6,'Grading Scale'!B$11,IF(R182<'Grading Scale'!G$5,'Grading Scale'!B$9,IF(R182<'Grading Scale'!G$4,'Grading Scale'!B$7,IF(R182<'Grading Scale'!G$3,'Grading Scale'!B$5,'Grading Scale'!B$3))))))","v":3},{"$f":"Scores!B173","v":0},{"$f":"IF(S182>='Grading Scale'!B$13,IF(S182='Grading Scale'!B$3,'Grading Scale'!C$3,IF(S182='Grading Scale'!B$5,'Grading Scale'!C$5,IF(S182='Grading Scale'!B$7,'Grading Scale'!C$7,IF(S182='Grading Scale'!B$9,'Grading Scale'!C$9,IF(S182='Grading Scale'!B$11,'Grading Scale'!C$11,'Grading Scale'!C$13))))),IF(S182='Grading Scale'!E$3,'Grading Scale'!F$3,IF(S182='Grading Scale'!E$5,'Grading Scale'!F$5,IF(S182='Grading Scale'!E$7,'Grading Scale'!F$7,IF(S182='Grading Scale'!E$9,'Grading Scale'!F$9,IF(S182='Grading Scale'!E$11,'Grading Scale'!F$11,'Grading Scale'!F$13))))))","v":"B    "}," ",null,""]
[{"$f":"Scores!A174","v":0},{"$f":"Scores!B174","v":0},{"$f":"Scores!C174","v":0},{"$f":"Scores!D174","v":0},{"$f":"Scores!E174","v":0},{"$f":"Scores!F174","v":0},{"$f":"Scores!G174","v":0},{"$f":"Scores!H174","v":0},{"$f":"Scores!I174","v":0},{"$f":"Scores!J174","v":0},{"$f":"Scores!K174","v":0},{"$f":"Scores!L174","v":0},{"$f":"Scores!M174","v":0},{"$f":"Scores!N174","v":0},{"$f":"Scores!O174","v":0},-0.70710678118654746,2.9512994231491119,2.9512994231491119,{"$f":"IF(R183<'Grading Scale'!G$8,IF(R183<'Grading Scale'!G$13,'Grading Scale'!E$13,IF(R183<'Grading Scale'!G$12,'Grading Scale'!E$11,IF(R183<'Grading Scale'!G$11,'Grading Scale'!E$9,IF(R183<'Grading Scale'!G$10,'Grading Scale'!E$7,IF(R183<'Grading Scale'!G$9,'Grading Scale'!E$5,'Grading Scale'!E$3))))),IF(R183<'Grading Scale'!G$7,'Grading Scale'!B$13,IF(R183<'Grading Scale'!G$6,'Grading Scale'!B$11,IF(R183<'Grading Scale'!G$5,'Grading Scale'!B$9,IF(R183<'Grading Scale'!G$4,'Grading Scale'!B$7,IF(R183<'Grading Scale'!G$3,'Grading Scale'!B$5,'Grading Scale'!B$3))))))","v":3},{"$f":"Scores!B174","v":0},{"$f":"IF(S183>='Grading Scale'!B$13,IF(S183='Grading Scale'!B$3,'Grading Scale'!C$3,IF(S183='Grading Scale'!B$5,'Grading Scale'!C$5,IF(S183='Grading Scale'!B$7,'Grading Scale'!C$7,IF(S183='Grading Scale'!B$9,'Grading Scale'!C$9,IF(S183='Grading Scale'!B$11,'Grading Scale'!C$11,'Grading Scale'!C$13))))),IF(S183='Grading Scale'!E$3,'Grading Scale'!F$3,IF(S183='Grading Scale'!E$5,'Grading Scale'!F$5,IF(S183='Grading Scale'!E$7,'Grading Scale'!F$7,IF(S183='Grading Scale'!E$9,'Grading Scale'!F$9,IF(S183='Grading Scale'!E$11,'Grading Scale'!F$11,'Grading Scale'!F$13))))))","v":"B    "}," ",null,""]
[{"$f":"Scores!A175","v":0},{"$f":"Scores!B175","v":0},{"$f":"Scores!C175","v":0},{"$f":"Scores!D175","v":0},{"$f":"Scores!E175","v":0},{"$f":"Scores!F175","v":0},{"$f":"Scores!G175","v":0},{"$f":"Scores!H175","v":0},{"$f":"Scores!I175","v":0},{"$f":"Scores!J175","v":0},{"$f":"Scores!K175","v":0},{"$f":"Scores!L175","v":0},{"$f":"Scores!M175","v":0},{"$f":"Scores!N175","v":0},{"$f":"Scores!O175","v":0},-0.70710678118654746,2.9512994231491119,2.9512994231491119,{"$f":"IF(R184<'Grading Scale'!G$8,IF(R184<'Grading Scale'!G$13,'Grading Scale'!E$13,IF(R184<'Grading Scale'!G$12,'Grading Scale'!E$11,IF(R184<'Grading Scale'!G$11,'Grading Scale'!E$9,IF(R184<'Grading Scale'!G$10,'Grading Scale'!E$7,IF(R184<'Grading Scale'!G$9,'Grading Scale'!E$5,'Grading Scale'!E$3))))),IF(R184<'Grading Scale'!G$7,'Grading Scale'!B$13,IF(R184<'Grading Scale'!G$6,'Grading Scale'!B$11,IF(R184<'Grading Scale'!G$5,'Grading Scale'!B$9,IF(R184<'Grading Scale'!G$4,'Grading Scale'!B$7,IF(R184<'Grading Scale'!G$3,'Grading Scale'!B$5,'Grading Scale'!B$3))))))","v":3},{"$f":"Scores!B175","v":0},{"$f":"IF(S184>='Grading Scale'!B$13,IF(S184='Grading Scale'!B$3,'Grading Scale'!C$3,IF(S184='Grading Scale'!B$5,'Grading Scale'!C$5,IF(S184='Grading Scale'!B$7,'Grading Scale'!C$7,IF(S184='Grading Scale'!B$9,'Grading Scale'!C$9,IF(S184='Grading Scale'!B$11,'Grading Scale'!C$11,'Grading Scale'!C$13))))),IF(S184='Grading Scale'!E$3,'Grading Scale'!F$3,IF(S184='Grading Scale'!E$5,'Grading Scale'!F$5,IF(S184='Grading Scale'!E$7,'Grading Scale'!F$7,IF(S184='Grading Scale'!E$9,'Grading Scale'!F$9,IF(S184='Grading Scale'!E$11,'Grading Scale'!F$11,'Grading Scale'!F$13))))))","v":"B    "}," ",null,""]
[{"$f":"Scores!A176","v":0},{"$f":"Scores!B176","v":0},{"$f":"Scores!C176","v":0},{"$f":"Scores!D176","v":0},{"$f":"Scores!E176","v":0},{"$f":"Scores!F176","v":0},{"$f":"Scores!G176","v":0},{"$f":"Scores!H176","v":0},{"$f":"Scores!I176","v":0},{"$f":"Scores!J176","v":0},{"$f":"Scores!K176","v":0},{"$f":"Scores!L176","v":0},{"$f":"Scores!M176","v":0},{"$f":"Scores!N176","v":0},{"$f":"Scores!O176","v":0},-0.70710678118654746,2.9512994231491119,2.9512994231491119,{"$f":"IF(R185<'Grading Scale'!G$8,IF(R185<'Grading Scale'!G$13,'Grading Scale'!E$13,IF(R185<'Grading Scale'!G$12,'Grading Scale'!E$11,IF(R185<'Grading Scale'!G$11,'Grading Scale'!E$9,IF(R185<'Grading Scale'!G$10,'Grading Scale'!E$7,IF(R185<'Grading Scale'!G$9,'Grading Scale'!E$5,'Grading Scale'!E$3))))),IF(R185<'Grading Scale'!G$7,'Grading Scale'!B$13,IF(R185<'Grading Scale'!G$6,'Grading Scale'!B$11,IF(R185<'Grading Scale'!G$5,'Grading Scale'!B$9,IF(R185<'Grading Scale'!G$4,'Grading Scale'!B$7,IF(R185<'Grading Scale'!G$3,'Grading Scale'!B$5,'Grading Scale'!B$3))))))","v":3},{"$f":"Scores!B176","v":0},{"$f":"IF(S185>='Grading Scale'!B$13,IF(S185='Grading Scale'!B$3,'Grading Scale'!C$3,IF(S185='Grading Scale'!B$5,'Grading Scale'!C$5,IF(S185='Grading Scale'!B$7,'Grading Scale'!C$7,IF(S185='Grading Scale'!B$9,'Grading Scale'!C$9,IF(S185='Grading Scale'!B$11,'Grading Scale'!C$11,'Grading Scale'!C$13))))),IF(S185='Grading Scale'!E$3,'Grading Scale'!F$3,IF(S185='Grading Scale'!E$5,'Grading Scale'!F$5,IF(S185='Grading Scale'!E$7,'Grading Scale'!F$7,IF(S185='Grading Scale'!E$9,'Grading Scale'!F$9,IF(S185='Grading Scale'!E$11,'Grading Scale'!F$11,'Grading Scale'!F$13))))))","v":"B    "}," ",null,""]
[{"$f":"Scores!A177","v":0},{"$f":"Scores!B177","v":0},{"$f":"Scores!C177","v":0},{"$f":"Scores!D177","v":0},{"$f":"Scores!E177","v":0},{"$f":"Scores!F177","v":0},{"$f":"Scores!G177","v":0},{"$f":"Scores!H177","v":0},{"$f":"Scores!I177","v":0},{"$f":"Scores!J177","v":0},{"$f":"Scores!K177","v":0},{"$f":"Scores!L177","v":0},{"$f":"Scores!M177","v":0},{"$f":"Scores!N177","v":0},{"$f":"Scores!O177","v":0},-0.70710678118654746,2.9512994231491119,2.9512994231491119,{"$f":"IF(R186<'Grading Scale'!G$8,IF(R186<'Grading Scale'!G$13,'Grading Scale'!E$13,IF(R186<'Grading Scale'!G$12,'Grading Scale'!E$11,IF(R186<'Grading Scale'!G$11,'Grading Scale'!E$9,IF(R186<'Grading Scale'!G$10,'Grading Scale'!E$7,IF(R186<'Grading Scale'!G$9,'Grading Scale'!E$5,'Grading Scale'!E$3))))),IF(R186<'Grading Scale'!G$7,'Grading Scale'!B$13,IF(R186<'Grading Scale'!G$6,'Grading Scale'!B$11,IF(R186<'Grading Scale'!G$5,'Grading Scale'!B$9,IF(R186<'Grading Scale'!G$4,'Grading Scale'!B$7,IF(R186<'Grading Scale'!G$3,'Grading Scale'!B$5,'Grading Scale'!B$3))))))","v":3},{"$f":"Scores!B177","v":0},{"$f":"IF(S186>='Grading Scale'!B$13,IF(S186='Grading Scale'!B$3,'Grading Scale'!C$3,IF(S186='Grading Scale'!B$5,'Grading Scale'!C$5,IF(S186='Grading Scale'!B$7,'Grading Scale'!C$7,IF(S186='Grading Scale'!B$9,'Grading Scale'!C$9,IF(S186='Grading Scale'!B$11,'Grading Scale'!C$11,'Grading Scale'!C$13))))),IF(S186='Grading Scale'!E$3,'Grading Scale'!F$3,IF(S186='Grading Scale'!E$5,'Grading Scale'!F$5,IF(S186='Grading Scale'!E$7,'Grading Scale'!F$7,IF(S186='Grading Scale'!E$9,'Grading Scale'!F$9,IF(S186='Grading Scale'!E$11,'Grading Scale'!F$11,'Grading Scale'!F$13))))))","v":"B    "}," ",null,""]
[{"$f":"Scores!A178","v":0},{"$f":"Scores!B178","v":0},{"$f":"Scores!C178","v":0},{"$f":"Scores!D178","v":0},{"$f":"Scores!E178","v":0},{"$f":"Scores!F178","v":0},{"$f":"Scores!G178","v":0},{"$f":"Scores!H178","v":0},{"$f":"Scores!I178","v":0},{"$f":"Scores!J178","v":0},{"$f":"Scores!K178","v":0},{"$f":"Scores!L178","v":0},{"$f":"Scores!M178","v":0},{"$f":"Scores!N178","v":0},{"$f":"Scores!O178","v":0},-0.70710678118654746,2.9512994231491119,2.9512994231491119,{"$f":"IF(R187<'Grading Scale'!G$8,IF(R187<'Grading Scale'!G$13,'Grading Scale'!E$13,IF(R187<'Grading Scale'!G$12,'Grading Scale'!E$11,IF(R187<'Grading Scale'!G$11,'Grading Scale'!E$9,IF(R187<'Grading Scale'!G$10,'Grading Scale'!E$7,IF(R187<'Grading Scale'!G$9,'Grading Scale'!E$5,'Grading Scale'!E$3))))),IF(R187<'Grading Scale'!G$7,'Grading Scale'!B$13,IF(R187<'Grading Scale'!G$6,'Grading Scale'!B$11,IF(R187<'Grading Scale'!G$5,'Grading Scale'!B$9,IF(R187<'Grading Scale'!G$4,'Grading Scale'!B$7,IF(R187<'Grading Scale'!G$3,'Grading Scale'!B$5,'Grading Scale'!B$3))))))","v":3},{"$f":"Scores!B178","v":0},{"$f":"IF(S187>='Grading Scale'!B$13,IF(S187='Grading Scale'!B$3,'Grading Scale'!C$3,IF(S187='Grading Scale'!B$5,'Grading Scale'!C$5,IF(S187='Grading Scale'!B$7,'Grading Scale'!C$7,IF(S187='Grading Scale'!B$9,'Grading Scale'!C$9,IF(S187='Grading Scale'!B$11,'Grading Scale'!C$11,'Grading Scale'!C$13))))),IF(S187='Grading Scale'!E$3,'Grading Scale'!F$3,IF(S187='Grading Scale'!E$5,'Grading Scale'!F$5,IF(S187='Grading Scale'!E$7,'Grading Scale'!F$7,IF(S187='Grading Scale'!E$9,'Grading Scale'!F$9,IF(S187='Grading Scale'!E$11,'Grading Scale'!F$11,'Grading Scale'!F$13))))))","v":"B    "}," ",null,""]
[{"$f":"Scores!A179","v":0},{"$f":"Scores!B179","v":0},{"$f":"Scores!C179","v":0},{"$f":"Scores!D179","v":0},{"$f":"Scores!E179","v":0},{"$f":"Scores!F179","v":0},{"$f":"Scores!G179","v":0},{"$f":"Scores!H179","v":0},{"$f":"Scores!I179","v":0},{"$f":"Scores!J179","v":0},{"$f":"Scores!K179","v":0},{"$f":"Scores!L179","v":0},{"$f":"Scores!M179","v":0},{"$f":"Scores!N179","v":0},{"$f":"Scores!O179","v":0},-0.70710678118654746,2.9512994231491119,2.9512994231491119,{"$f":"IF(R188<'Grading Scale'!G$8,IF(R188<'Grading Scale'!G$13,'Grading Scale'!E$13,IF(R188<'Grading Scale'!G$12,'Grading Scale'!E$11,IF(R188<'Grading Scale'!G$11,'Grading Scale'!E$9,IF(R188<'Grading Scale'!G$10,'Grading Scale'!E$7,IF(R188<'Grading Scale'!G$9,'Grading Scale'!E$5,'Grading Scale'!E$3))))),IF(R188<'Grading Scale'!G$7,'Grading Scale'!B$13,IF(R188<'Grading Scale'!G$6,'Grading Scale'!B$11,IF(R188<'Grading Scale'!G$5,'Grading Scale'!B$9,IF(R188<'Grading Scale'!G$4,'Grading Scale'!B$7,IF(R188<'Grading Scale'!G$3,'Grading Scale'!B$5,'Grading Scale'!B$3))))))","v":3},{"$f":"Scores!B179","v":0},{"$f":"IF(S188>='Grading Scale'!B$13,IF(S188='Grading Scale'!B$3,'Grading Scale'!C$3,IF(S188='Grading Scale'!B$5,'Grading Scale'!C$5,IF(S188='Grading Scale'!B$7,'Grading Scale'!C$7,IF(S188='Grading Scale'!B$9,'Grading Scale'!C$9,IF(S188='Grading Scale'!B$11,'Grading Scale'!C$11,'Grading Scale'!C$13))))),IF(S188='Grading Scale'!E$3,'Grading Scale'!F$3,IF(S188='Grading Scale'!E$5,'Grading Scale'!F$5,IF(S188='Grading Scale'!E$7,'Grading Scale'!F$7,IF(S188='Grading Scale'!E$9,'Grading Scale'!F$9,IF(S188='Grading Scale'!E$11,'Grading Scale'!F$11,'Grading Scale'!F$13))))))","v":"B    "}," ",null,""]
[{"$f":"Scores!A180","v":0},{"$f":"Scores!B180","v":0},{"$f":"Scores!C180","v":0},{"$f":"Scores!D180","v":0},{"$f":"Scores!E180","v":0},{"$f":"Scores!F180","v":0},{"$f":"Scores!G180","v":0},{"$f":"Scores!H180","v":0},{"$f":"Scores!I180","v":0},{"$f":"Scores!J180","v":0},{"$f":"Scores!K180","v":0},{"$f":"Scores!L180","v":0},{"$f":"Scores!M180","v":0},{"$f":"Scores!N180","v":0},{"$f":"Scores!O180","v":0},-0.70710678118654746,2.9512994231491119,2.9512994231491119,{"$f":"IF(R189<'Grading Scale'!G$8,IF(R189<'Grading Scale'!G$13,'Grading Scale'!E$13,IF(R189<'Grading Scale'!G$12,'Grading Scale'!E$11,IF(R189<'Grading Scale'!G$11,'Grading Scale'!E$9,IF(R189<'Grading Scale'!G$10,'Grading Scale'!E$7,IF(R189<'Grading Scale'!G$9,'Grading Scale'!E$5,'Grading Scale'!E$3))))),IF(R189<'Grading Scale'!G$7,'Grading Scale'!B$13,IF(R189<'Grading Scale'!G$6,'Grading Scale'!B$11,IF(R189<'Grading Scale'!G$5,'Grading Scale'!B$9,IF(R189<'Grading Scale'!G$4,'Grading Scale'!B$7,IF(R189<'Grading Scale'!G$3,'Grading Scale'!B$5,'Grading Scale'!B$3))))))","v":3},{"$f":"Scores!B180","v":0},{"$f":"IF(S189>='Grading Scale'!B$13,IF(S189='Grading Scale'!B$3,'Grading Scale'!C$3,IF(S189='Grading Scale'!B$5,'Grading Scale'!C$5,IF(S189='Grading Scale'!B$7,'Grading Scale'!C$7,IF(S189='Grading Scale'!B$9,'Grading Scale'!C$9,IF(S189='Grading Scale'!B$11,'Grading Scale'!C$11,'Grading Scale'!C$13))))),IF(S189='Grading Scale'!E$3,'Grading Scale'!F$3,IF(S189='Grading Scale'!E$5,'Grading Scale'!F$5,IF(S189='Grading Scale'!E$7,'Grading Scale'!F$7,IF(S189='Grading Scale'!E$9,'Grading Scale'!F$9,IF(S189='Grading Scale'!E$11,'Grading Scale'!F$11,'Grading Scale'!F$13))))))","v":"B    "}," ",null,""]
[{"$f":"Scores!A181","v":0},{"$f":"Scores!B181","v":0},{"$f":"Scores!C181","v":0},{"$f":"Scores!D181","v":0},{"$f":"Scores!E181","v":0},{"$f":"Scores!F181","v":0},{"$f":"Scores!G181","v":0},{"$f":"Scores!H181","v":0},{"$f":"Scores!I181","v":0},{"$f":"Scores!J181","v":0},{"$f":"Scores!K181","v":0},{"$f":"Scores!L181","v":0},{"$f":"Scores!M181","v":0},{"$f":"Scores!N181","v":0},{"$f":"Scores!O181","v":0},-0.70710678118654746,2.9512994231491119,2.9512994231491119,{"$f":"IF(R190<'Grading Scale'!G$8,IF(R190<'Grading Scale'!G$13,'Grading Scale'!E$13,IF(R190<'Grading Scale'!G$12,'Grading Scale'!E$11,IF(R190<'Grading Scale'!G$11,'Grading Scale'!E$9,IF(R190<'Grading Scale'!G$10,'Grading Scale'!E$7,IF(R190<'Grading Scale'!G$9,'Grading Scale'!E$5,'Grading Scale'!E$3))))),IF(R190<'Grading Scale'!G$7,'Grading Scale'!B$13,IF(R190<'Grading Scale'!G$6,'Grading Scale'!B$11,IF(R190<'Grading Scale'!G$5,'Grading Scale'!B$9,IF(R190<'Grading Scale'!G$4,'Grading Scale'!B$7,IF(R190<'Grading Scale'!G$3,'Grading Scale'!B$5,'Grading Scale'!B$3))))))","v":3},{"$f":"Scores!B181","v":0},{"$f":"IF(S190>='Grading Scale'!B$13,IF(S190='Grading Scale'!B$3,'Grading Scale'!C$3,IF(S190='Grading Scale'!B$5,'Grading Scale'!C$5,IF(S190='Grading Scale'!B$7,'Grading Scale'!C$7,IF(S190='Grading Scale'!B$9,'Grading Scale'!C$9,IF(S190='Grading Scale'!B$11,'Grading Scale'!C$11,'Grading Scale'!C$13))))),IF(S190='Grading Scale'!E$3,'Grading Scale'!F$3,IF(S190='Grading Scale'!E$5,'Grading Scale'!F$5,IF(S190='Grading Scale'!E$7,'Grading Scale'!F$7,IF(S190='Grading Scale'!E$9,'Grading Scale'!F$9,IF(S190='Grading Scale'!E$11,'Grading Scale'!F$11,'Grading Scale'!F$13))))))","v":"B    "}," ",null,""]
[{"$f":"Scores!A182","v":0},{"$f":"Scores!B182","v":0},{"$f":"Scores!C182","v":0},{"$f":"Scores!D182","v":0},{"$f":"Scores!E182","v":0},{"$f":"Scores!F182","v":0},{"$f":"Scores!G182","v":0},{"$f":"Scores!H182","v":0},{"$f":"Scores!I182","v":0},{"$f":"Scores!J182","v":0},{"$f":"Scores!K182","v":0},{"$f":"Scores!L182","v":0},{"$f":"Scores!M182","v":0},{"$f":"Scores!N182","v":0},{"$f":"Scores!O182","v":0},-0.70710678118654746,2.9512994231491119,2.9512994231491119,{"$f":"IF(R191<'Grading Scale'!G$8,IF(R191<'Grading Scale'!G$13,'Grading Scale'!E$13,IF(R191<'Grading Scale'!G$12,'Grading Scale'!E$11,IF(R191<'Grading Scale'!G$11,'Grading Scale'!E$9,IF(R191<'Grading Scale'!G$10,'Grading Scale'!E$7,IF(R191<'Grading Scale'!G$9,'Grading Scale'!E$5,'Grading Scale'!E$3))))),IF(R191<'Grading Scale'!G$7,'Grading Scale'!B$13,IF(R191<'Grading Scale'!G$6,'Grading Scale'!B$11,IF(R191<'Grading Scale'!G$5,'Grading Scale'!B$9,IF(R191<'Grading Scale'!G$4,'Grading Scale'!B$7,IF(R191<'Grading Scale'!G$3,'Grading Scale'!B$5,'Grading Scale'!B$3))))))","v":3},{"$f":"Scores!B182","v":0},{"$f":"IF(S191>='Grading Scale'!B$13,IF(S191='Grading Scale'!B$3,'Grading Scale'!C$3,IF(S191='Grading Scale'!B$5,'Grading Scale'!C$5,IF(S191='Grading Scale'!B$7,'Grading Scale'!C$7,IF(S191='Grading Scale'!B$9,'Grading Scale'!C$9,IF(S191='Grading Scale'!B$11,'Grading Scale'!C$11,'Grading Scale'!C$13))))),IF(S191='Grading Scale'!E$3,'Grading Scale'!F$3,IF(S191='Grading Scale'!E$5,'Grading Scale'!F$5,IF(S191='Grading Scale'!E$7,'Grading Scale'!F$7,IF(S191='Grading Scale'!E$9,'Grading Scale'!F$9,IF(S191='Grading Scale'!E$11,'Grading Scale'!F$11,'Grading Scale'!F$13))))))","v":"B    "}," ",null,""]
[{"$f":"Scores!A183","v":0},{"$f":"Scores!B183","v":0},{"$f":"Scores!C183","v":0},{"$f":"Scores!D183","v":0},{"$f":"Scores!E183","v":0},{"$f":"Scores!F183","v":0},{"$f":"Scores!G183","v":0},{"$f":"Scores!H183","v":0},{"$f":"Scores!I183","v":0},{"$f":"Scores!J183","v":0},{"$f":"Scores!K183","v":0},{"$f":"Scores!L183","v":0},{"$f":"Scores!M183","v":0},{"$f":"Scores!N183","v":0},{"$f":"Scores!O183","v":0},-0.70710678118654746,2.9512994231491119,2.9512994231491119,{"$f":"IF(R192<'Grading Scale'!G$8,IF(R192<'Grading Scale'!G$13,'Grading Scale'!E$13,IF(R192<'Grading Scale'!G$12,'Grading Scale'!E$11,IF(R192<'Grading Scale'!G$11,'Grading Scale'!E$9,IF(R192<'Grading Scale'!G$10,'Grading Scale'!E$7,IF(R192<'Grading Scale'!G$9,'Grading Scale'!E$5,'Grading Scale'!E$3))))),IF(R192<'Grading Scale'!G$7,'Grading Scale'!B$13,IF(R192<'Grading Scale'!G$6,'Grading Scale'!B$11,IF(R192<'Grading Scale'!G$5,'Grading Scale'!B$9,IF(R192<'Grading Scale'!G$4,'Grading Scale'!B$7,IF(R192<'Grading Scale'!G$3,'Grading Scale'!B$5,'Grading Scale'!B$3))))))","v":3},{"$f":"Scores!B183","v":0},{"$f":"IF(S192>='Grading Scale'!B$13,IF(S192='Grading Scale'!B$3,'Grading Scale'!C$3,IF(S192='Grading Scale'!B$5,'Grading Scale'!C$5,IF(S192='Grading Scale'!B$7,'Grading Scale'!C$7,IF(S192='Grading Scale'!B$9,'Grading Scale'!C$9,IF(S192='Grading Scale'!B$11,'Grading Scale'!C$11,'Grading Scale'!C$13))))),IF(S192='Grading Scale'!E$3,'Grading Scale'!F$3,IF(S192='Grading Scale'!E$5,'Grading Scale'!F$5,IF(S192='Grading Scale'!E$7,'Grading Scale'!F$7,IF(S192='Grading Scale'!E$9,'Grading Scale'!F$9,IF(S192='Grading Scale'!E$11,'Grading Scale'!F$11,'Grading Scale'!F$13))))))","v":"B    "}," ",null,""]
[{"$f":"Scores!A184","v":0},{"$f":"Scores!B184","v":0},{"$f":"Scores!C184","v":0},{"$f":"Scores!D184","v":0},{"$f":"Scores!E184","v":0},{"$f":"Scores!F184","v":0},{"$f":"Scores!G184","v":0},{"$f":"Scores!H184","v":0},{"$f":"Scores!I184","v":0},{"$f":"Scores!J184","v":0},{"$f":"Scores!K184","v":0},{"$f":"Scores!L184","v":0},{"$f":"Scores!M184","v":0},{"$f":"Scores!N184","v":0},{"$f":"Scores!O184","v":0},-0.70710678118654746,2.9512994231491119,2.9512994231491119,{"$f":"IF(R193<'Grading Scale'!G$8,IF(R193<'Grading Scale'!G$13,'Grading Scale'!E$13,IF(R193<'Grading Scale'!G$12,'Grading Scale'!E$11,IF(R193<'Grading Scale'!G$11,'Grading Scale'!E$9,IF(R193<'Grading Scale'!G$10,'Grading Scale'!E$7,IF(R193<'Grading Scale'!G$9,'Grading Scale'!E$5,'Grading Scale'!E$3))))),IF(R193<'Grading Scale'!G$7,'Grading Scale'!B$13,IF(R193<'Grading Scale'!G$6,'Grading Scale'!B$11,IF(R193<'Grading Scale'!G$5,'Grading Scale'!B$9,IF(R193<'Grading Scale'!G$4,'Grading Scale'!B$7,IF(R193<'Grading Scale'!G$3,'Grading Scale'!B$5,'Grading Scale'!B$3))))))","v":3},{"$f":"Scores!B184","v":0},{"$f":"IF(S193>='Grading Scale'!B$13,IF(S193='Grading Scale'!B$3,'Grading Scale'!C$3,IF(S193='Grading Scale'!B$5,'Grading Scale'!C$5,IF(S193='Grading Scale'!B$7,'Grading Scale'!C$7,IF(S193='Grading Scale'!B$9,'Grading Scale'!C$9,IF(S193='Grading Scale'!B$11,'Grading Scale'!C$11,'Grading Scale'!C$13))))),IF(S193='Grading Scale'!E$3,'Grading Scale'!F$3,IF(S193='Grading Scale'!E$5,'Grading Scale'!F$5,IF(S193='Grading Scale'!E$7,'Grading Scale'!F$7,IF(S193='Grading Scale'!E$9,'Grading Scale'!F$9,IF(S193='Grading Scale'!E$11,'Grading Scale'!F$11,'Grading Scale'!F$13))))))","v":"B    "}," ",null,""]
[{"$f":"Scores!A185","v":0},{"$f":"Scores!B185","v":0},{"$f":"Scores!C185","v":0},{"$f":"Scores!D185","v":0},{"$f":"Scores!E185","v":0},{"$f":"Scores!F185","v":0},{"$f":"Scores!G185","v":0},{"$f":"Scores!H185","v":0},{"$f":"Scores!I185","v":0},{"$f":"Scores!J185","v":0},{"$f":"Scores!K185","v":0},{"$f":"Scores!L185","v":0},{"$f":"Scores!M185","v":0},{"$f":"Scores!N185","v":0},{"$f":"Scores!O185","v":0},-0.70710678118654746,2.9512994231491119,2.9512994231491119,{"$f":"IF(R194<'Grading Scale'!G$8,IF(R194<'Grading Scale'!G$13,'Grading Scale'!E$13,IF(R194<'Grading Scale'!G$12,'Grading Scale'!E$11,IF(R194<'Grading Scale'!G$11,'Grading Scale'!E$9,IF(R194<'Grading Scale'!G$10,'Grading Scale'!E$7,IF(R194<'Grading Scale'!G$9,'Grading Scale'!E$5,'Grading Scale'!E$3))))),IF(R194<'Grading Scale'!G$7,'Grading Scale'!B$13,IF(R194<'Grading Scale'!G$6,'Grading Scale'!B$11,IF(R194<'Grading Scale'!G$5,'Grading Scale'!B$9,IF(R194<'Grading Scale'!G$4,'Grading Scale'!B$7,IF(R194<'Grading Scale'!G$3,'Grading Scale'!B$5,'Grading Scale'!B$3))))))","v":3},{"$f":"Scores!B185","v":0},{"$f":"IF(S194>='Grading Scale'!B$13,IF(S194='Grading Scale'!B$3,'Grading Scale'!C$3,IF(S194='Grading Scale'!B$5,'Grading Scale'!C$5,IF(S194='Grading Scale'!B$7,'Grading Scale'!C$7,IF(S194='Grading Scale'!B$9,'Grading Scale'!C$9,IF(S194='Grading Scale'!B$11,'Grading Scale'!C$11,'Grading Scale'!C$13))))),IF(S194='Grading Scale'!E$3,'Grading Scale'!F$3,IF(S194='Grading Scale'!E$5,'Grading Scale'!F$5,IF(S194='Grading Scale'!E$7,'Grading Scale'!F$7,IF(S194='Grading Scale'!E$9,'Grading Scale'!F$9,IF(S194='Grading Scale'!E$11,'Grading Scale'!F$11,'Grading Scale'!F$13))))))","v":"B    "}," ",null,""]
[{"$f":"Scores!A186","v":0},{"$f":"Scores!B186","v":0},{"$f":"Scores!C186","v":0},{"$f":"Scores!D186","v":0},{"$f":"Scores!E186","v":0},{"$f":"Scores!F186","v":0},{"$f":"Scores!G186","v":0},{"$f":"Scores!H186","v":0},{"$f":"Scores!I186","v":0},{"$f":"Scores!J186","v":0},{"$f":"Scores!K186","v":0},{"$f":"Scores!L186","v":0},{"$f":"Scores!M186","v":0},{"$f":"Scores!N186","v":0},{"$f":"Scores!O186","v":0},-0.70710678118654746,2.9512994231491119,2.9512994231491119,{"$f":"IF(R195<'Grading Scale'!G$8,IF(R195<'Grading Scale'!G$13,'Grading Scale'!E$13,IF(R195<'Grading Scale'!G$12,'Grading Scale'!E$11,IF(R195<'Grading Scale'!G$11,'Grading Scale'!E$9,IF(R195<'Grading Scale'!G$10,'Grading Scale'!E$7,IF(R195<'Grading Scale'!G$9,'Grading Scale'!E$5,'Grading Scale'!E$3))))),IF(R195<'Grading Scale'!G$7,'Grading Scale'!B$13,IF(R195<'Grading Scale'!G$6,'Grading Scale'!B$11,IF(R195<'Grading Scale'!G$5,'Grading Scale'!B$9,IF(R195<'Grading Scale'!G$4,'Grading Scale'!B$7,IF(R195<'Grading Scale'!G$3,'Grading Scale'!B$5,'Grading Scale'!B$3))))))","v":3},{"$f":"Scores!B186","v":0},{"$f":"IF(S195>='Grading Scale'!B$13,IF(S195='Grading Scale'!B$3,'Grading Scale'!C$3,IF(S195='Grading Scale'!B$5,'Grading Scale'!C$5,IF(S195='Grading Scale'!B$7,'Grading Scale'!C$7,IF(S195='Grading Scale'!B$9,'Grading Scale'!C$9,IF(S195='Grading Scale'!B$11,'Grading Scale'!C$11,'Grading Scale'!C$13))))),IF(S195='Grading Scale'!E$3,'Grading Scale'!F$3,IF(S195='Grading Scale'!E$5,'Grading Scale'!F$5,IF(S195='Grading Scale'!E$7,'Grading Scale'!F$7,IF(S195='Grading Scale'!E$9,'Grading Scale'!F$9,IF(S195='Grading Scale'!E$11,'Grading Scale'!F$11,'Grading Scale'!F$13))))))","v":"B    "}," ",null,""]
[{"$f":"Scores!A187","v":0},{"$f":"Scores!B187","v":0},{"$f":"Scores!C187","v":0},{"$f":"Scores!D187","v":0},{"$f":"Scores!E187","v":0},{"$f":"Scores!F187","v":0},{"$f":"Scores!G187","v":0},{"$f":"Scores!H187","v":0},{"$f":"Scores!I187","v":0},{"$f":"Scores!J187","v":0},{"$f":"Scores!K187","v":0},{"$f":"Scores!L187","v":0},{"$f":"Scores!M187","v":0},{"$f":"Scores!N187","v":0},{"$f":"Scores!O187","v":0},-0.70710678118654746,2.9512994231491119,2.9512994231491119,{"$f":"IF(R196<'Grading Scale'!G$8,IF(R196<'Grading Scale'!G$13,'Grading Scale'!E$13,IF(R196<'Grading Scale'!G$12,'Grading Scale'!E$11,IF(R196<'Grading Scale'!G$11,'Grading Scale'!E$9,IF(R196<'Grading Scale'!G$10,'Grading Scale'!E$7,IF(R196<'Grading Scale'!G$9,'Grading Scale'!E$5,'Grading Scale'!E$3))))),IF(R196<'Grading Scale'!G$7,'Grading Scale'!B$13,IF(R196<'Grading Scale'!G$6,'Grading Scale'!B$11,IF(R196<'Grading Scale'!G$5,'Grading Scale'!B$9,IF(R196<'Grading Scale'!G$4,'Grading Scale'!B$7,IF(R196<'Grading Scale'!G$3,'Grading Scale'!B$5,'Grading Scale'!B$3))))))","v":3},{"$f":"Scores!B187","v":0},{"$f":"IF(S196>='Grading Scale'!B$13,IF(S196='Grading Scale'!B$3,'Grading Scale'!C$3,IF(S196='Grading Scale'!B$5,'Grading Scale'!C$5,IF(S196='Grading Scale'!B$7,'Grading Scale'!C$7,IF(S196='Grading Scale'!B$9,'Grading Scale'!C$9,IF(S196='Grading Scale'!B$11,'Grading Scale'!C$11,'Grading Scale'!C$13))))),IF(S196='Grading Scale'!E$3,'Grading Scale'!F$3,IF(S196='Grading Scale'!E$5,'Grading Scale'!F$5,IF(S196='Grading Scale'!E$7,'Grading Scale'!F$7,IF(S196='Grading Scale'!E$9,'Grading Scale'!F$9,IF(S196='Grading Scale'!E$11,'Grading Scale'!F$11,'Grading Scale'!F$13))))))","v":"B    "}," ",null,""]
[{"$f":"Scores!A188","v":0},{"$f":"Scores!B188","v":0},{"$f":"Scores!C188","v":0},{"$f":"Scores!D188","v":0},{"$f":"Scores!E188","v":0},{"$f":"Scores!F188","v":0},{"$f":"Scores!G188","v":0},{"$f":"Scores!H188","v":0},{"$f":"Scores!I188","v":0},{"$f":"Scores!J188","v":0},{"$f":"Scores!K188","v":0},{"$f":"Scores!L188","v":0},{"$f":"Scores!M188","v":0},{"$f":"Scores!N188","v":0},{"$f":"Scores!O188","v":0},-0.70710678118654746,2.9512994231491119,2.9512994231491119,{"$f":"IF(R197<'Grading Scale'!G$8,IF(R197<'Grading Scale'!G$13,'Grading Scale'!E$13,IF(R197<'Grading Scale'!G$12,'Grading Scale'!E$11,IF(R197<'Grading Scale'!G$11,'Grading Scale'!E$9,IF(R197<'Grading Scale'!G$10,'Grading Scale'!E$7,IF(R197<'Grading Scale'!G$9,'Grading Scale'!E$5,'Grading Scale'!E$3))))),IF(R197<'Grading Scale'!G$7,'Grading Scale'!B$13,IF(R197<'Grading Scale'!G$6,'Grading Scale'!B$11,IF(R197<'Grading Scale'!G$5,'Grading Scale'!B$9,IF(R197<'Grading Scale'!G$4,'Grading Scale'!B$7,IF(R197<'Grading Scale'!G$3,'Grading Scale'!B$5,'Grading Scale'!B$3))))))","v":3},{"$f":"Scores!B188","v":0},{"$f":"IF(S197>='Grading Scale'!B$13,IF(S197='Grading Scale'!B$3,'Grading Scale'!C$3,IF(S197='Grading Scale'!B$5,'Grading Scale'!C$5,IF(S197='Grading Scale'!B$7,'Grading Scale'!C$7,IF(S197='Grading Scale'!B$9,'Grading Scale'!C$9,IF(S197='Grading Scale'!B$11,'Grading Scale'!C$11,'Grading Scale'!C$13))))),IF(S197='Grading Scale'!E$3,'Grading Scale'!F$3,IF(S197='Grading Scale'!E$5,'Grading Scale'!F$5,IF(S197='Grading Scale'!E$7,'Grading Scale'!F$7,IF(S197='Grading Scale'!E$9,'Grading Scale'!F$9,IF(S197='Grading Scale'!E$11,'Grading Scale'!F$11,'Grading Scale'!F$13))))))","v":"B    "}," ",null,""]
[{"$f":"Scores!A189","v":0},{"$f":"Scores!B189","v":0},{"$f":"Scores!C189","v":0},{"$f":"Scores!D189","v":0},{"$f":"Scores!E189","v":0},{"$f":"Scores!F189","v":0},{"$f":"Scores!G189","v":0},{"$f":"Scores!H189","v":0},{"$f":"Scores!I189","v":0},{"$f":"Scores!J189","v":0},{"$f":"Scores!K189","v":0},{"$f":"Scores!L189","v":0},{"$f":"Scores!M189","v":0},{"$f":"Scores!N189","v":0},{"$f":"Scores!O189","v":0},-0.70710678118654746,2.9512994231491119,2.9512994231491119,{"$f":"IF(R198<'Grading Scale'!G$8,IF(R198<'Grading Scale'!G$13,'Grading Scale'!E$13,IF(R198<'Grading Scale'!G$12,'Grading Scale'!E$11,IF(R198<'Grading Scale'!G$11,'Grading Scale'!E$9,IF(R198<'Grading Scale'!G$10,'Grading Scale'!E$7,IF(R198<'Grading Scale'!G$9,'Grading Scale'!E$5,'Grading Scale'!E$3))))),IF(R198<'Grading Scale'!G$7,'Grading Scale'!B$13,IF(R198<'Grading Scale'!G$6,'Grading Scale'!B$11,IF(R198<'Grading Scale'!G$5,'Grading Scale'!B$9,IF(R198<'Grading Scale'!G$4,'Grading Scale'!B$7,IF(R198<'Grading Scale'!G$3,'Grading Scale'!B$5,'Grading Scale'!B$3))))))","v":3},{"$f":"Scores!B189","v":0},{"$f":"IF(S198>='Grading Scale'!B$13,IF(S198='Grading Scale'!B$3,'Grading Scale'!C$3,IF(S198='Grading Scale'!B$5,'Grading Scale'!C$5,IF(S198='Grading Scale'!B$7,'Grading Scale'!C$7,IF(S198='Grading Scale'!B$9,'Grading Scale'!C$9,IF(S198='Grading Scale'!B$11,'Grading Scale'!C$11,'Grading Scale'!C$13))))),IF(S198='Grading Scale'!E$3,'Grading Scale'!F$3,IF(S198='Grading Scale'!E$5,'Grading Scale'!F$5,IF(S198='Grading Scale'!E$7,'Grading Scale'!F$7,IF(S198='Grading Scale'!E$9,'Grading Scale'!F$9,IF(S198='Grading Scale'!E$11,'Grading Scale'!F$11,'Grading Scale'!F$13))))))","v":"B    "}," ",null,""]
[{"$f":"Scores!A190","v":0},{"$f":"Scores!B190","v":0},{"$f":"Scores!C190","v":0},{"$f":"Scores!D190","v":0},{"$f":"Scores!E190","v":0},{"$f":"Scores!F190","v":0},{"$f":"Scores!G190","v":0},{"$f":"Scores!H190","v":0},{"$f":"Scores!I190","v":0},{"$f":"Scores!J190","v":0},{"$f":"Scores!K190","v":0},{"$f":"Scores!L190","v":0},{"$f":"Scores!M190","v":0},{"$f":"Scores!N190","v":0},{"$f":"Scores!O190","v":0},-0.70710678118654746,2.9512994231491119,2.9512994231491119,{"$f":"IF(R199<'Grading Scale'!G$8,IF(R199<'Grading Scale'!G$13,'Grading Scale'!E$13,IF(R199<'Grading Scale'!G$12,'Grading Scale'!E$11,IF(R199<'Grading Scale'!G$11,'Grading Scale'!E$9,IF(R199<'Grading Scale'!G$10,'Grading Scale'!E$7,IF(R199<'Grading Scale'!G$9,'Grading Scale'!E$5,'Grading Scale'!E$3))))),IF(R199<'Grading Scale'!G$7,'Grading Scale'!B$13,IF(R199<'Grading Scale'!G$6,'Grading Scale'!B$11,IF(R199<'Grading Scale'!G$5,'Grading Scale'!B$9,IF(R199<'Grading Scale'!G$4,'Grading Scale'!B$7,IF(R199<'Grading Scale'!G$3,'Grading Scale'!B$5,'Grading Scale'!B$3))))))","v":3},{"$f":"Scores!B190","v":0},{"$f":"IF(S199>='Grading Scale'!B$13,IF(S199='Grading Scale'!B$3,'Grading Scale'!C$3,IF(S199='Grading Scale'!B$5,'Grading Scale'!C$5,IF(S199='Grading Scale'!B$7,'Grading Scale'!C$7,IF(S199='Grading Scale'!B$9,'Grading Scale'!C$9,IF(S199='Grading Scale'!B$11,'Grading Scale'!C$11,'Grading Scale'!C$13))))),IF(S199='Grading Scale'!E$3,'Grading Scale'!F$3,IF(S199='Grading Scale'!E$5,'Grading Scale'!F$5,IF(S199='Grading Scale'!E$7,'Grading Scale'!F$7,IF(S199='Grading Scale'!E$9,'Grading Scale'!F$9,IF(S199='Grading Scale'!E$11,'Grading Scale'!F$11,'Grading Scale'!F$13))))))","v":"B    "}," ",null,""]
[{"$f":"Scores!A191","v":0},{"$f":"Scores!B191","v":0},{"$f":"Scores!C191","v":0},{"$f":"Scores!D191","v":0},{"$f":"Scores!E191","v":0},{"$f":"Scores!F191","v":0},{"$f":"Scores!G191","v":0},{"$f":"Scores!H191","v":0},{"$f":"Scores!I191","v":0},{"$f":"Scores!J191","v":0},{"$f":"Scores!K191","v":0},{"$f":"Scores!L191","v":0},{"$f":"Scores!M191","v":0},{"$f":"Scores!N191","v":0},{"$f":"Scores!O191","v":0},-0.70710678118654746,2.9512994231491119,2.9512994231491119,{"$f":"IF(R200<'Grading Scale'!G$8,IF(R200<'Grading Scale'!G$13,'Grading Scale'!E$13,IF(R200<'Grading Scale'!G$12,'Grading Scale'!E$11,IF(R200<'Grading Scale'!G$11,'Grading Scale'!E$9,IF(R200<'Grading Scale'!G$10,'Grading Scale'!E$7,IF(R200<'Grading Scale'!G$9,'Grading Scale'!E$5,'Grading Scale'!E$3))))),IF(R200<'Grading Scale'!G$7,'Grading Scale'!B$13,IF(R200<'Grading Scale'!G$6,'Grading Scale'!B$11,IF(R200<'Grading Scale'!G$5,'Grading Scale'!B$9,IF(R200<'Grading Scale'!G$4,'Grading Scale'!B$7,IF(R200<'Grading Scale'!G$3,'Grading Scale'!B$5,'Grading Scale'!B$3))))))","v":3},{"$f":"Scores!B191","v":0},{"$f":"IF(S200>='Grading Scale'!B$13,IF(S200='Grading Scale'!B$3,'Grading Scale'!C$3,IF(S200='Grading Scale'!B$5,'Grading Scale'!C$5,IF(S200='Grading Scale'!B$7,'Grading Scale'!C$7,IF(S200='Grading Scale'!B$9,'Grading Scale'!C$9,IF(S200='Grading Scale'!B$11,'Grading Scale'!C$11,'Grading Scale'!C$13))))),IF(S200='Grading Scale'!E$3,'Grading Scale'!F$3,IF(S200='Grading Scale'!E$5,'Grading Scale'!F$5,IF(S200='Grading Scale'!E$7,'Grading Scale'!F$7,IF(S200='Grading Scale'!E$9,'Grading Scale'!F$9,IF(S200='Grading Scale'!E$11,'Grading Scale'!F$11,'Grading Scale'!F$13))))))","v":"B    "}," ",null,""]
[{"$f":"Scores!A192","v":0},{"$f":"Scores!B192","v":0},{"$f":"Scores!C192","v":0},{"$f":"Scores!D192","v":0},{"$f":"Scores!E192","v":0},{"$f":"Scores!F192","v":0},{"$f":"Scores!G192","v":0},{"$f":"Scores!H192","v":0},{"$f":"Scores!I192","v":0},{"$f":"Scores!J192","v":0},{"$f":"Scores!K192","v":0},{"$f":"Scores!L192","v":0},{"$f":"Scores!M192","v":0},{"$f":"Scores!N192","v":0},{"$f":"Scores!O192","v":0},-0.70710678118654746,2.9512994231491119,2.9512994231491119,{"$f":"IF(R201<'Grading Scale'!G$8,IF(R201<'Grading Scale'!G$13,'Grading Scale'!E$13,IF(R201<'Grading Scale'!G$12,'Grading Scale'!E$11,IF(R201<'Grading Scale'!G$11,'Grading Scale'!E$9,IF(R201<'Grading Scale'!G$10,'Grading Scale'!E$7,IF(R201<'Grading Scale'!G$9,'Grading Scale'!E$5,'Grading Scale'!E$3))))),IF(R201<'Grading Scale'!G$7,'Grading Scale'!B$13,IF(R201<'Grading Scale'!G$6,'Grading Scale'!B$11,IF(R201<'Grading Scale'!G$5,'Grading Scale'!B$9,IF(R201<'Grading Scale'!G$4,'Grading Scale'!B$7,IF(R201<'Grading Scale'!G$3,'Grading Scale'!B$5,'Grading Scale'!B$3))))))","v":3},{"$f":"Scores!B192","v":0},{"$f":"IF(S201>='Grading Scale'!B$13,IF(S201='Grading Scale'!B$3,'Grading Scale'!C$3,IF(S201='Grading Scale'!B$5,'Grading Scale'!C$5,IF(S201='Grading Scale'!B$7,'Grading Scale'!C$7,IF(S201='Grading Scale'!B$9,'Grading Scale'!C$9,IF(S201='Grading Scale'!B$11,'Grading Scale'!C$11,'Grading Scale'!C$13))))),IF(S201='Grading Scale'!E$3,'Grading Scale'!F$3,IF(S201='Grading Scale'!E$5,'Grading Scale'!F$5,IF(S201='Grading Scale'!E$7,'Grading Scale'!F$7,IF(S201='Grading Scale'!E$9,'Grading Scale'!F$9,IF(S201='Grading Scale'!E$11,'Grading Scale'!F$11,'Grading Scale'!F$13))))))","v":"B    "}," ",null,""]
[{"$f":"Scores!A193","v":0},{"$f":"Scores!B193","v":0},{"$f":"Scores!C193","v":0},{"$f":"Scores!D193","v":0},{"$f":"Scores!E193","v":0},{"$f":"Scores!F193","v":0},{"$f":"Scores!G193","v":0},{"$f":"Scores!H193","v":0},{"$f":"Scores!I193","v":0},{"$f":"Scores!J193","v":0},{"$f":"Scores!K193","v":0},{"$f":"Scores!L193","v":0},{"$f":"Scores!M193","v":0},{"$f":"Scores!N193","v":0},{"$f":"Scores!O193","v":0},-0.70710678118654746,2.9512994231491119,2.9512994231491119,{"$f":"IF(R202<'Grading Scale'!G$8,IF(R202<'Grading Scale'!G$13,'Grading Scale'!E$13,IF(R202<'Grading Scale'!G$12,'Grading Scale'!E$11,IF(R202<'Grading Scale'!G$11,'Grading Scale'!E$9,IF(R202<'Grading Scale'!G$10,'Grading Scale'!E$7,IF(R202<'Grading Scale'!G$9,'Grading Scale'!E$5,'Grading Scale'!E$3))))),IF(R202<'Grading Scale'!G$7,'Grading Scale'!B$13,IF(R202<'Grading Scale'!G$6,'Grading Scale'!B$11,IF(R202<'Grading Scale'!G$5,'Grading Scale'!B$9,IF(R202<'Grading Scale'!G$4,'Grading Scale'!B$7,IF(R202<'Grading Scale'!G$3,'Grading Scale'!B$5,'Grading Scale'!B$3))))))","v":3},{"$f":"Scores!B193","v":0},{"$f":"IF(S202>='Grading Scale'!B$13,IF(S202='Grading Scale'!B$3,'Grading Scale'!C$3,IF(S202='Grading Scale'!B$5,'Grading Scale'!C$5,IF(S202='Grading Scale'!B$7,'Grading Scale'!C$7,IF(S202='Grading Scale'!B$9,'Grading Scale'!C$9,IF(S202='Grading Scale'!B$11,'Grading Scale'!C$11,'Grading Scale'!C$13))))),IF(S202='Grading Scale'!E$3,'Grading Scale'!F$3,IF(S202='Grading Scale'!E$5,'Grading Scale'!F$5,IF(S202='Grading Scale'!E$7,'Grading Scale'!F$7,IF(S202='Grading Scale'!E$9,'Grading Scale'!F$9,IF(S202='Grading Scale'!E$11,'Grading Scale'!F$11,'Grading Scale'!F$13))))))","v":"B    "}," ",null,""]
[{"$f":"Scores!A194","v":0},{"$f":"Scores!B194","v":0},{"$f":"Scores!C194","v":0},{"$f":"Scores!D194","v":0},{"$f":"Scores!E194","v":0},{"$f":"Scores!F194","v":0},{"$f":"Scores!G194","v":0},{"$f":"Scores!H194","v":0},{"$f":"Scores!I194","v":0},{"$f":"Scores!J194","v":0},{"$f":"Scores!K194","v":0},{"$f":"Scores!L194","v":0},{"$f":"Scores!M194","v":0},{"$f":"Scores!N194","v":0},{"$f":"Scores!O194","v":0},-0.70710678118654746,2.9512994231491119,2.9512994231491119,{"$f":"IF(R203<'Grading Scale'!G$8,IF(R203<'Grading Scale'!G$13,'Grading Scale'!E$13,IF(R203<'Grading Scale'!G$12,'Grading Scale'!E$11,IF(R203<'Grading Scale'!G$11,'Grading Scale'!E$9,IF(R203<'Grading Scale'!G$10,'Grading Scale'!E$7,IF(R203<'Grading Scale'!G$9,'Grading Scale'!E$5,'Grading Scale'!E$3))))),IF(R203<'Grading Scale'!G$7,'Grading Scale'!B$13,IF(R203<'Grading Scale'!G$6,'Grading Scale'!B$11,IF(R203<'Grading Scale'!G$5,'Grading Scale'!B$9,IF(R203<'Grading Scale'!G$4,'Grading Scale'!B$7,IF(R203<'Grading Scale'!G$3,'Grading Scale'!B$5,'Grading Scale'!B$3))))))","v":3},{"$f":"Scores!B194","v":0},{"$f":"IF(S203>='Grading Scale'!B$13,IF(S203='Grading Scale'!B$3,'Grading Scale'!C$3,IF(S203='Grading Scale'!B$5,'Grading Scale'!C$5,IF(S203='Grading Scale'!B$7,'Grading Scale'!C$7,IF(S203='Grading Scale'!B$9,'Grading Scale'!C$9,IF(S203='Grading Scale'!B$11,'Grading Scale'!C$11,'Grading Scale'!C$13))))),IF(S203='Grading Scale'!E$3,'Grading Scale'!F$3,IF(S203='Grading Scale'!E$5,'Grading Scale'!F$5,IF(S203='Grading Scale'!E$7,'Grading Scale'!F$7,IF(S203='Grading Scale'!E$9,'Grading Scale'!F$9,IF(S203='Grading Scale'!E$11,'Grading Scale'!F$11,'Grading Scale'!F$13))))))","v":"B    "}," ",null,""]
[{"$f":"Scores!A195","v":0},{"$f":"Scores!B195","v":0},{"$f":"Scores!C195","v":0},{"$f":"Scores!D195","v":0},{"$f":"Scores!E195","v":0},{"$f":"Scores!F195","v":0},{"$f":"Scores!G195","v":0},{"$f":"Scores!H195","v":0},{"$f":"Scores!I195","v":0},{"$f":"Scores!J195","v":0},{"$f":"Scores!K195","v":0},{"$f":"Scores!L195","v":0},{"$f":"Scores!M195","v":0},{"$f":"Scores!N195","v":0},{"$f":"Scores!O195","v":0},-0.70710678118654746,2.9512994231491119,2.9512994231491119,{"$f":"IF(R204<'Grading Scale'!G$8,IF(R204<'Grading Scale'!G$13,'Grading Scale'!E$13,IF(R204<'Grading Scale'!G$12,'Grading Scale'!E$11,IF(R204<'Grading Scale'!G$11,'Grading Scale'!E$9,IF(R204<'Grading Scale'!G$10,'Grading Scale'!E$7,IF(R204<'Grading Scale'!G$9,'Grading Scale'!E$5,'Grading Scale'!E$3))))),IF(R204<'Grading Scale'!G$7,'Grading Scale'!B$13,IF(R204<'Grading Scale'!G$6,'Grading Scale'!B$11,IF(R204<'Grading Scale'!G$5,'Grading Scale'!B$9,IF(R204<'Grading Scale'!G$4,'Grading Scale'!B$7,IF(R204<'Grading Scale'!G$3,'Grading Scale'!B$5,'Grading Scale'!B$3))))))","v":3},{"$f":"Scores!B195","v":0},{"$f":"IF(S204>='Grading Scale'!B$13,IF(S204='Grading Scale'!B$3,'Grading Scale'!C$3,IF(S204='Grading Scale'!B$5,'Grading Scale'!C$5,IF(S204='Grading Scale'!B$7,'Grading Scale'!C$7,IF(S204='Grading Scale'!B$9,'Grading Scale'!C$9,IF(S204='Grading Scale'!B$11,'Grading Scale'!C$11,'Grading Scale'!C$13))))),IF(S204='Grading Scale'!E$3,'Grading Scale'!F$3,IF(S204='Grading Scale'!E$5,'Grading Scale'!F$5,IF(S204='Grading Scale'!E$7,'Grading Scale'!F$7,IF(S204='Grading Scale'!E$9,'Grading Scale'!F$9,IF(S204='Grading Scale'!E$11,'Grading Scale'!F$11,'Grading Scale'!F$13))))))","v":"B    "}," ",null,""]
[{"$f":"Scores!A196","v":0},{"$f":"Scores!B196","v":0},{"$f":"Scores!C196","v":0},{"$f":"Scores!D196","v":0},{"$f":"Scores!E196","v":0},{"$f":"Scores!F196","v":0},{"$f":"Scores!G196","v":0},{"$f":"Scores!H196","v":0},{"$f":"Scores!I196","v":0},{"$f":"Scores!J196","v":0},{"$f":"Scores!K196","v":0},{"$f":"Scores!L196","v":0},{"$f":"Scores!M196","v":0},{"$f":"Scores!N196","v":0},{"$f":"Scores!O196","v":0},-0.70710678118654746,2.9512994231491119,2.9512994231491119,{"$f":"IF(R205<'Grading Scale'!G$8,IF(R205<'Grading Scale'!G$13,'Grading Scale'!E$13,IF(R205<'Grading Scale'!G$12,'Grading Scale'!E$11,IF(R205<'Grading Scale'!G$11,'Grading Scale'!E$9,IF(R205<'Grading Scale'!G$10,'Grading Scale'!E$7,IF(R205<'Grading Scale'!G$9,'Grading Scale'!E$5,'Grading Scale'!E$3))))),IF(R205<'Grading Scale'!G$7,'Grading Scale'!B$13,IF(R205<'Grading Scale'!G$6,'Grading Scale'!B$11,IF(R205<'Grading Scale'!G$5,'Grading Scale'!B$9,IF(R205<'Grading Scale'!G$4,'Grading Scale'!B$7,IF(R205<'Grading Scale'!G$3,'Grading Scale'!B$5,'Grading Scale'!B$3))))))","v":3},{"$f":"Scores!B196","v":0},{"$f":"IF(S205>='Grading Scale'!B$13,IF(S205='Grading Scale'!B$3,'Grading Scale'!C$3,IF(S205='Grading Scale'!B$5,'Grading Scale'!C$5,IF(S205='Grading Scale'!B$7,'Grading Scale'!C$7,IF(S205='Grading Scale'!B$9,'Grading Scale'!C$9,IF(S205='Grading Scale'!B$11,'Grading Scale'!C$11,'Grading Scale'!C$13))))),IF(S205='Grading Scale'!E$3,'Grading Scale'!F$3,IF(S205='Grading Scale'!E$5,'Grading Scale'!F$5,IF(S205='Grading Scale'!E$7,'Grading Scale'!F$7,IF(S205='Grading Scale'!E$9,'Grading Scale'!F$9,IF(S205='Grading Scale'!E$11,'Grading Scale'!F$11,'Grading Scale'!F$13))))))","v":"B    "}," ",null,""]
[{"$f":"Scores!A197","v":0},{"$f":"Scores!B197","v":0},{"$f":"Scores!C197","v":0},{"$f":"Scores!D197","v":0},{"$f":"Scores!E197","v":0},{"$f":"Scores!F197","v":0},{"$f":"Scores!G197","v":0},{"$f":"Scores!H197","v":0},{"$f":"Scores!I197","v":0},{"$f":"Scores!J197","v":0},{"$f":"Scores!K197","v":0},{"$f":"Scores!L197","v":0},{"$f":"Scores!M197","v":0},{"$f":"Scores!N197","v":0},{"$f":"Scores!O197","v":0},-0.70710678118654746,2.9512994231491119,2.9512994231491119,{"$f":"IF(R206<'Grading Scale'!G$8,IF(R206<'Grading Scale'!G$13,'Grading Scale'!E$13,IF(R206<'Grading Scale'!G$12,'Grading Scale'!E$11,IF(R206<'Grading Scale'!G$11,'Grading Scale'!E$9,IF(R206<'Grading Scale'!G$10,'Grading Scale'!E$7,IF(R206<'Grading Scale'!G$9,'Grading Scale'!E$5,'Grading Scale'!E$3))))),IF(R206<'Grading Scale'!G$7,'Grading Scale'!B$13,IF(R206<'Grading Scale'!G$6,'Grading Scale'!B$11,IF(R206<'Grading Scale'!G$5,'Grading Scale'!B$9,IF(R206<'Grading Scale'!G$4,'Grading Scale'!B$7,IF(R206<'Grading Scale'!G$3,'Grading Scale'!B$5,'Grading Scale'!B$3))))))","v":3},{"$f":"Scores!B197","v":0},{"$f":"IF(S206>='Grading Scale'!B$13,IF(S206='Grading Scale'!B$3,'Grading Scale'!C$3,IF(S206='Grading Scale'!B$5,'Grading Scale'!C$5,IF(S206='Grading Scale'!B$7,'Grading Scale'!C$7,IF(S206='Grading Scale'!B$9,'Grading Scale'!C$9,IF(S206='Grading Scale'!B$11,'Grading Scale'!C$11,'Grading Scale'!C$13))))),IF(S206='Grading Scale'!E$3,'Grading Scale'!F$3,IF(S206='Grading Scale'!E$5,'Grading Scale'!F$5,IF(S206='Grading Scale'!E$7,'Grading Scale'!F$7,IF(S206='Grading Scale'!E$9,'Grading Scale'!F$9,IF(S206='Grading Scale'!E$11,'Grading Scale'!F$11,'Grading Scale'!F$13))))))","v":"B    "}," ",null,""]
[{"$f":"Scores!A198","v":0},{"$f":"Scores!B198","v":0},{"$f":"Scores!C198","v":0},{"$f":"Scores!D198","v":0},{"$f":"Scores!E198","v":0},{"$f":"Scores!F198","v":0},{"$f":"Scores!G198","v":0},{"$f":"Scores!H198","v":0},{"$f":"Scores!I198","v":0},{"$f":"Scores!J198","v":0},{"$f":"Scores!K198","v":0},{"$f":"Scores!L198","v":0},{"$f":"Scores!M198","v":0},{"$f":"Scores!N198","v":0},{"$f":"Scores!O198","v":0},-0.70710678118654746,2.9512994231491119,2.9512994231491119,{"$f":"IF(R207<'Grading Scale'!G$8,IF(R207<'Grading Scale'!G$13,'Grading Scale'!E$13,IF(R207<'Grading Scale'!G$12,'Grading Scale'!E$11,IF(R207<'Grading Scale'!G$11,'Grading Scale'!E$9,IF(R207<'Grading Scale'!G$10,'Grading Scale'!E$7,IF(R207<'Grading Scale'!G$9,'Grading Scale'!E$5,'Grading Scale'!E$3))))),IF(R207<'Grading Scale'!G$7,'Grading Scale'!B$13,IF(R207<'Grading Scale'!G$6,'Grading Scale'!B$11,IF(R207<'Grading Scale'!G$5,'Grading Scale'!B$9,IF(R207<'Grading Scale'!G$4,'Grading Scale'!B$7,IF(R207<'Grading Scale'!G$3,'Grading Scale'!B$5,'Grading Scale'!B$3))))))","v":3},{"$f":"Scores!B198","v":0},{"$f":"IF(S207>='Grading Scale'!B$13,IF(S207='Grading Scale'!B$3,'Grading Scale'!C$3,IF(S207='Grading Scale'!B$5,'Grading Scale'!C$5,IF(S207='Grading Scale'!B$7,'Grading Scale'!C$7,IF(S207='Grading Scale'!B$9,'Grading Scale'!C$9,IF(S207='Grading Scale'!B$11,'Grading Scale'!C$11,'Grading Scale'!C$13))))),IF(S207='Grading Scale'!E$3,'Grading Scale'!F$3,IF(S207='Grading Scale'!E$5,'Grading Scale'!F$5,IF(S207='Grading Scale'!E$7,'Grading Scale'!F$7,IF(S207='Grading Scale'!E$9,'Grading Scale'!F$9,IF(S207='Grading Scale'!E$11,'Grading Scale'!F$11,'Grading Scale'!F$13))))))","v":"B    "}," ",null,""]
[{"$f":"Scores!A199","v":0},{"$f":"Scores!B199","v":0},{"$f":"Scores!C199","v":0},{"$f":"Scores!D199","v":0},{"$f":"Scores!E199","v":0},{"$f":"Scores!F199","v":0},{"$f":"Scores!G199","v":0},{"$f":"Scores!H199","v":0},{"$f":"Scores!I199","v":0},{"$f":"Scores!J199","v":0},{"$f":"Scores!K199","v":0},{"$f":"Scores!L199","v":0},{"$f":"Scores!M199","v":0},{"$f":"Scores!N199","v":0},{"$f":"Scores!O199","v":0},-0.70710678118654746,2.9512994231491119,2.9512994231491119,{"$f":"IF(R208<'Grading Scale'!G$8,IF(R208<'Grading Scale'!G$13,'Grading Scale'!E$13,IF(R208<'Grading Scale'!G$12,'Grading Scale'!E$11,IF(R208<'Grading Scale'!G$11,'Grading Scale'!E$9,IF(R208<'Grading Scale'!G$10,'Grading Scale'!E$7,IF(R208<'Grading Scale'!G$9,'Grading Scale'!E$5,'Grading Scale'!E$3))))),IF(R208<'Grading Scale'!G$7,'Grading Scale'!B$13,IF(R208<'Grading Scale'!G$6,'Grading Scale'!B$11,IF(R208<'Grading Scale'!G$5,'Grading Scale'!B$9,IF(R208<'Grading Scale'!G$4,'Grading Scale'!B$7,IF(R208<'Grading Scale'!G$3,'Grading Scale'!B$5,'Grading Scale'!B$3))))))","v":3},{"$f":"Scores!B199","v":0},{"$f":"IF(S208>='Grading Scale'!B$13,IF(S208='Grading Scale'!B$3,'Grading Scale'!C$3,IF(S208='Grading Scale'!B$5,'Grading Scale'!C$5,IF(S208='Grading Scale'!B$7,'Grading Scale'!C$7,IF(S208='Grading Scale'!B$9,'Grading Scale'!C$9,IF(S208='Grading Scale'!B$11,'Grading Scale'!C$11,'Grading Scale'!C$13))))),IF(S208='Grading Scale'!E$3,'Grading Scale'!F$3,IF(S208='Grading Scale'!E$5,'Grading Scale'!F$5,IF(S208='Grading Scale'!E$7,'Grading Scale'!F$7,IF(S208='Grading Scale'!E$9,'Grading Scale'!F$9,IF(S208='Grading Scale'!E$11,'Grading Scale'!F$11,'Grading Scale'!F$13))))))","v":"B    "}," ",null,""]
[{"$f":"Scores!A200","v":0},{"$f":"Scores!B200","v":0},{"$f":"Scores!C200","v":0},{"$f":"Scores!D200","v":0},{"$f":"Scores!E200","v":0},{"$f":"Scores!F200","v":0},{"$f":"Scores!G200","v":0},{"$f":"Scores!H200","v":0},{"$f":"Scores!I200","v":0},{"$f":"Scores!J200","v":0},{"$f":"Scores!K200","v":0},{"$f":"Scores!L200","v":0},{"$f":"Scores!M200","v":0},{"$f":"Scores!N200","v":0},{"$f":"Scores!O200","v":0},-0.70710678118654746,2.9512994231491119,2.9512994231491119,{"$f":"IF(R209<'Grading Scale'!G$8,IF(R209<'Grading Scale'!G$13,'Grading Scale'!E$13,IF(R209<'Grading Scale'!G$12,'Grading Scale'!E$11,IF(R209<'Grading Scale'!G$11,'Grading Scale'!E$9,IF(R209<'Grading Scale'!G$10,'Grading Scale'!E$7,IF(R209<'Grading Scale'!G$9,'Grading Scale'!E$5,'Grading Scale'!E$3))))),IF(R209<'Grading Scale'!G$7,'Grading Scale'!B$13,IF(R209<'Grading Scale'!G$6,'Grading Scale'!B$11,IF(R209<'Grading Scale'!G$5,'Grading Scale'!B$9,IF(R209<'Grading Scale'!G$4,'Grading Scale'!B$7,IF(R209<'Grading Scale'!G$3,'Grading Scale'!B$5,'Grading Scale'!B$3))))))","v":3},{"$f":"Scores!B200","v":0},{"$f":"IF(S209>='Grading Scale'!B$13,IF(S209='Grading Scale'!B$3,'Grading Scale'!C$3,IF(S209='Grading Scale'!B$5,'Grading Scale'!C$5,IF(S209='Grading Scale'!B$7,'Grading Scale'!C$7,IF(S209='Grading Scale'!B$9,'Grading Scale'!C$9,IF(S209='Grading Scale'!B$11,'Grading Scale'!C$11,'Grading Scale'!C$13))))),IF(S209='Grading Scale'!E$3,'Grading Scale'!F$3,IF(S209='Grading Scale'!E$5,'Grading Scale'!F$5,IF(S209='Grading Scale'!E$7,'Grading Scale'!F$7,IF(S209='Grading Scale'!E$9,'Grading Scale'!F$9,IF(S209='Grading Scale'!E$11,'Grading Scale'!F$11,'Grading Scale'!F$13))))))","v":"B    "}," ",null,""]
[{"$f":"Scores!A201","v":0},{"$f":"Scores!B201","v":0},{"$f":"Scores!C201","v":0},{"$f":"Scores!D201","v":0},{"$f":"Scores!E201","v":0},{"$f":"Scores!F201","v":0},{"$f":"Scores!G201","v":0},{"$f":"Scores!H201","v":0},{"$f":"Scores!I201","v":0},{"$f":"Scores!J201","v":0},{"$f":"Scores!K201","v":0},{"$f":"Scores!L201","v":0},{"$f":"Scores!M201","v":0},{"$f":"Scores!N201","v":0},{"$f":"Scores!O201","v":0},-0.70710678118654746,2.9512994231491119,2.9512994231491119,{"$f":"IF(R210<'Grading Scale'!G$8,IF(R210<'Grading Scale'!G$13,'Grading Scale'!E$13,IF(R210<'Grading Scale'!G$12,'Grading Scale'!E$11,IF(R210<'Grading Scale'!G$11,'Grading Scale'!E$9,IF(R210<'Grading Scale'!G$10,'Grading Scale'!E$7,IF(R210<'Grading Scale'!G$9,'Grading Scale'!E$5,'Grading Scale'!E$3))))),IF(R210<'Grading Scale'!G$7,'Grading Scale'!B$13,IF(R210<'Grading Scale'!G$6,'Grading Scale'!B$11,IF(R210<'Grading Scale'!G$5,'Grading Scale'!B$9,IF(R210<'Grading Scale'!G$4,'Grading Scale'!B$7,IF(R210<'Grading Scale'!G$3,'Grading Scale'!B$5,'Grading Scale'!B$3))))))","v":3},{"$f":"Scores!B201","v":0},{"$f":"IF(S210>='Grading Scale'!B$13,IF(S210='Grading Scale'!B$3,'Grading Scale'!C$3,IF(S210='Grading Scale'!B$5,'Grading Scale'!C$5,IF(S210='Grading Scale'!B$7,'Grading Scale'!C$7,IF(S210='Grading Scale'!B$9,'Grading Scale'!C$9,IF(S210='Grading Scale'!B$11,'Grading Scale'!C$11,'Grading Scale'!C$13))))),IF(S210='Grading Scale'!E$3,'Grading Scale'!F$3,IF(S210='Grading Scale'!E$5,'Grading Scale'!F$5,IF(S210='Grading Scale'!E$7,'Grading Scale'!F$7,IF(S210='Grading Scale'!E$9,'Grading Scale'!F$9,IF(S210='Grading Scale'!E$11,'Grading Scale'!F$11,'Grading Scale'!F$13))))))","v":"B    "}," ",null,""]
[{"$f":"Scores!A202","v":0},{"$f":"Scores!B202","v":0},{"$f":"Scores!C202","v":0},{"$f":"Scores!D202","v":0},{"$f":"Scores!E202","v":0},{"$f":"Scores!F202","v":0},{"$f":"Scores!G202","v":0},{"$f":"Scores!H202","v":0},{"$f":"Scores!I202","v":0},{"$f":"Scores!J202","v":0},{"$f":"Scores!K202","v":0},{"$f":"Scores!L202","v":0},{"$f":"Scores!M202","v":0},{"$f":"Scores!N202","v":0},{"$f":"Scores!O202","v":0},-0.70710678118654746,2.9512994231491119,2.9512994231491119,{"$f":"IF(R211<'Grading Scale'!G$8,IF(R211<'Grading Scale'!G$13,'Grading Scale'!E$13,IF(R211<'Grading Scale'!G$12,'Grading Scale'!E$11,IF(R211<'Grading Scale'!G$11,'Grading Scale'!E$9,IF(R211<'Grading Scale'!G$10,'Grading Scale'!E$7,IF(R211<'Grading Scale'!G$9,'Grading Scale'!E$5,'Grading Scale'!E$3))))),IF(R211<'Grading Scale'!G$7,'Grading Scale'!B$13,IF(R211<'Grading Scale'!G$6,'Grading Scale'!B$11,IF(R211<'Grading Scale'!G$5,'Grading Scale'!B$9,IF(R211<'Grading Scale'!G$4,'Grading Scale'!B$7,IF(R211<'Grading Scale'!G$3,'Grading Scale'!B$5,'Grading Scale'!B$3))))))","v":3},{"$f":"Scores!B202","v":0},{"$f":"IF(S211>='Grading Scale'!B$13,IF(S211='Grading Scale'!B$3,'Grading Scale'!C$3,IF(S211='Grading Scale'!B$5,'Grading Scale'!C$5,IF(S211='Grading Scale'!B$7,'Grading Scale'!C$7,IF(S211='Grading Scale'!B$9,'Grading Scale'!C$9,IF(S211='Grading Scale'!B$11,'Grading Scale'!C$11,'Grading Scale'!C$13))))),IF(S211='Grading Scale'!E$3,'Grading Scale'!F$3,IF(S211='Grading Scale'!E$5,'Grading Scale'!F$5,IF(S211='Grading Scale'!E$7,'Grading Scale'!F$7,IF(S211='Grading Scale'!E$9,'Grading Scale'!F$9,IF(S211='Grading Scale'!E$11,'Grading Scale'!F$11,'Grading Scale'!F$13))))))","v":"B    "}," ",null,""]
[{"$f":"Scores!A203","v":0},{"$f":"Scores!B203","v":0},{"$f":"Scores!C203","v":0},{"$f":"Scores!D203","v":0},{"$f":"Scores!E203","v":0},{"$f":"Scores!F203","v":0},{"$f":"Scores!G203","v":0},{"$f":"Scores!H203","v":0},{"$f":"Scores!I203","v":0},{"$f":"Scores!J203","v":0},{"$f":"Scores!K203","v":0},{"$f":"Scores!L203","v":0},{"$f":"Scores!M203","v":0},{"$f":"Scores!N203","v":0},{"$f":"Scores!O203","v":0},-0.70710678118654746,2.9512994231491119,2.9512994231491119,{"$f":"IF(R212<'Grading Scale'!G$8,IF(R212<'Grading Scale'!G$13,'Grading Scale'!E$13,IF(R212<'Grading Scale'!G$12,'Grading Scale'!E$11,IF(R212<'Grading Scale'!G$11,'Grading Scale'!E$9,IF(R212<'Grading Scale'!G$10,'Grading Scale'!E$7,IF(R212<'Grading Scale'!G$9,'Grading Scale'!E$5,'Grading Scale'!E$3))))),IF(R212<'Grading Scale'!G$7,'Grading Scale'!B$13,IF(R212<'Grading Scale'!G$6,'Grading Scale'!B$11,IF(R212<'Grading Scale'!G$5,'Grading Scale'!B$9,IF(R212<'Grading Scale'!G$4,'Grading Scale'!B$7,IF(R212<'Grading Scale'!G$3,'Grading Scale'!B$5,'Grading Scale'!B$3))))))","v":3},{"$f":"Scores!B203","v":0},{"$f":"IF(S212>='Grading Scale'!B$13,IF(S212='Grading Scale'!B$3,'Grading Scale'!C$3,IF(S212='Grading Scale'!B$5,'Grading Scale'!C$5,IF(S212='Grading Scale'!B$7,'Grading Scale'!C$7,IF(S212='Grading Scale'!B$9,'Grading Scale'!C$9,IF(S212='Grading Scale'!B$11,'Grading Scale'!C$11,'Grading Scale'!C$13))))),IF(S212='Grading Scale'!E$3,'Grading Scale'!F$3,IF(S212='Grading Scale'!E$5,'Grading Scale'!F$5,IF(S212='Grading Scale'!E$7,'Grading Scale'!F$7,IF(S212='Grading Scale'!E$9,'Grading Scale'!F$9,IF(S212='Grading Scale'!E$11,'Grading Scale'!F$11,'Grading Scale'!F$13))))))","v":"B    "}," ",null,""]
[{"$f":"Scores!A204","v":0},{"$f":"Scores!B204","v":0},{"$f":"Scores!C204","v":0},{"$f":"Scores!D204","v":0},{"$f":"Scores!E204","v":0},{"$f":"Scores!F204","v":0},{"$f":"Scores!G204","v":0},{"$f":"Scores!H204","v":0},{"$f":"Scores!I204","v":0},{"$f":"Scores!J204","v":0},{"$f":"Scores!K204","v":0},{"$f":"Scores!L204","v":0},{"$f":"Scores!M204","v":0},{"$f":"Scores!N204","v":0},{"$f":"Scores!O204","v":0},-0.70710678118654746,2.9512994231491119,2.9512994231491119,{"$f":"IF(R213<'Grading Scale'!G$8,IF(R213<'Grading Scale'!G$13,'Grading Scale'!E$13,IF(R213<'Grading Scale'!G$12,'Grading Scale'!E$11,IF(R213<'Grading Scale'!G$11,'Grading Scale'!E$9,IF(R213<'Grading Scale'!G$10,'Grading Scale'!E$7,IF(R213<'Grading Scale'!G$9,'Grading Scale'!E$5,'Grading Scale'!E$3))))),IF(R213<'Grading Scale'!G$7,'Grading Scale'!B$13,IF(R213<'Grading Scale'!G$6,'Grading Scale'!B$11,IF(R213<'Grading Scale'!G$5,'Grading Scale'!B$9,IF(R213<'Grading Scale'!G$4,'Grading Scale'!B$7,IF(R213<'Grading Scale'!G$3,'Grading Scale'!B$5,'Grading Scale'!B$3))))))","v":3},{"$f":"Scores!B204","v":0},{"$f":"IF(S213>='Grading Scale'!B$13,IF(S213='Grading Scale'!B$3,'Grading Scale'!C$3,IF(S213='Grading Scale'!B$5,'Grading Scale'!C$5,IF(S213='Grading Scale'!B$7,'Grading Scale'!C$7,IF(S213='Grading Scale'!B$9,'Grading Scale'!C$9,IF(S213='Grading Scale'!B$11,'Grading Scale'!C$11,'Grading Scale'!C$13))))),IF(S213='Grading Scale'!E$3,'Grading Scale'!F$3,IF(S213='Grading Scale'!E$5,'Grading Scale'!F$5,IF(S213='Grading Scale'!E$7,'Grading Scale'!F$7,IF(S213='Grading Scale'!E$9,'Grading Scale'!F$9,IF(S213='Grading Scale'!E$11,'Grading Scale'!F$11,'Grading Scale'!F$13))))))","v":"B    "}," ",null,""]
[{"$f":"Scores!A205","v":0},{"$f":"Scores!B205","v":0},{"$f":"Scores!C205","v":0},{"$f":"Scores!D205","v":0},{"$f":"Scores!E205","v":0},{"$f":"Scores!F205","v":0},{"$f":"Scores!G205","v":0},{"$f":"Scores!H205","v":0},{"$f":"Scores!I205","v":0},{"$f":"Scores!J205","v":0},{"$f":"Scores!K205","v":0},{"$f":"Scores!L205","v":0},{"$f":"Scores!M205","v":0},{"$f":"Scores!N205","v":0},{"$f":"Scores!O205","v":0},-0.70710678118654746,2.9512994231491119,2.9512994231491119,{"$f":"IF(R214<'Grading Scale'!G$8,IF(R214<'Grading Scale'!G$13,'Grading Scale'!E$13,IF(R214<'Grading Scale'!G$12,'Grading Scale'!E$11,IF(R214<'Grading Scale'!G$11,'Grading Scale'!E$9,IF(R214<'Grading Scale'!G$10,'Grading Scale'!E$7,IF(R214<'Grading Scale'!G$9,'Grading Scale'!E$5,'Grading Scale'!E$3))))),IF(R214<'Grading Scale'!G$7,'Grading Scale'!B$13,IF(R214<'Grading Scale'!G$6,'Grading Scale'!B$11,IF(R214<'Grading Scale'!G$5,'Grading Scale'!B$9,IF(R214<'Grading Scale'!G$4,'Grading Scale'!B$7,IF(R214<'Grading Scale'!G$3,'Grading Scale'!B$5,'Grading Scale'!B$3))))))","v":3},{"$f":"Scores!B205","v":0},{"$f":"IF(S214>='Grading Scale'!B$13,IF(S214='Grading Scale'!B$3,'Grading Scale'!C$3,IF(S214='Grading Scale'!B$5,'Grading Scale'!C$5,IF(S214='Grading Scale'!B$7,'Grading Scale'!C$7,IF(S214='Grading Scale'!B$9,'Grading Scale'!C$9,IF(S214='Grading Scale'!B$11,'Grading Scale'!C$11,'Grading Scale'!C$13))))),IF(S214='Grading Scale'!E$3,'Grading Scale'!F$3,IF(S214='Grading Scale'!E$5,'Grading Scale'!F$5,IF(S214='Grading Scale'!E$7,'Grading Scale'!F$7,IF(S214='Grading Scale'!E$9,'Grading Scale'!F$9,IF(S214='Grading Scale'!E$11,'Grading Scale'!F$11,'Grading Scale'!F$13))))))","v":"B    "}," ",null,""]
[{"$f":"Scores!A206","v":0},{"$f":"Scores!B206","v":0},{"$f":"Scores!C206","v":0},{"$f":"Scores!D206","v":0},{"$f":"Scores!E206","v":0},{"$f":"Scores!F206","v":0},{"$f":"Scores!G206","v":0},{"$f":"Scores!H206","v":0},{"$f":"Scores!I206","v":0},{"$f":"Scores!J206","v":0},{"$f":"Scores!K206","v":0},{"$f":"Scores!L206","v":0},{"$f":"Scores!M206","v":0},{"$f":"Scores!N206","v":0},{"$f":"Scores!O206","v":0},{"$f":"(C215-$C$17)*$C$19+(D215-$D$17)*$D$19+(E215-$E$17)*$E$19+(F215-$F$17)*$F$19+(G215-$G$17)*$G$19+(H215-$H$17)*$H$19+(I215-$I$17)*$I$19+(J215-$J$17)*$J$19+(K215-$K$17)*$K$19+(L215-$L$17)*$L$19","v":-0.70710678118654746},{"$f":"(((P215-$P$19)/$P$16)*$S$2)+$S$1","v":2.9512994231491119},{"$f":"Q215+(N215*N$21)+(O215*O$21)","v":2.9512994231491119},{"$f":"IF(R215<'Grading Scale'!G$8,IF(R215<'Grading Scale'!G$13,'Grading Scale'!E$13,IF(R215<'Grading Scale'!G$12,'Grading Scale'!E$11,IF(R215<'Grading Scale'!G$11,'Grading Scale'!E$9,IF(R215<'Grading Scale'!G$10,'Grading Scale'!E$7,IF(R215<'Grading Scale'!G$9,'Grading Scale'!E$5,'Grading Scale'!E$3))))),IF(R215<'Grading Scale'!G$7,'Grading Scale'!B$13,IF(R215<'Grading Scale'!G$6,'Grading Scale'!B$11,IF(R215<'Grading Scale'!G$5,'Grading Scale'!B$9,IF(R215<'Grading Scale'!G$4,'Grading Scale'!B$7,IF(R215<'Grading Scale'!G$3,'Grading Scale'!B$5,'Grading Scale'!B$3))))))","v":3},{"$f":"Scores!B206","v":0},{"$f":"IF(S215>='Grading Scale'!B$13,IF(S215='Grading Scale'!B$3,'Grading Scale'!C$3,IF(S215='Grading Scale'!B$5,'Grading Scale'!C$5,IF(S215='Grading Scale'!B$7,'Grading Scale'!C$7,IF(S215='Grading Scale'!B$9,'Grading Scale'!C$9,IF(S215='Grading Scale'!B$11,'Grading Scale'!C$11,'Grading Scale'!C$13))))),IF(S215='Grading Scale'!E$3,'Grading Scale'!F$3,IF(S215='Grading Scale'!E$5,'Grading Scale'!F$5,IF(S215='Grading Scale'!E$7,'Grading Scale'!F$7,IF(S215='Grading Scale'!E$9,'Grading Scale'!F$9,IF(S215='Grading Scale'!E$11,'Grading Scale'!F$11,'Grading Scale'!F$13))))))","v":"B    "},{"$f":"IF(P215=$P$17,\"BEST\",\" \")","v":" "},null,{"$f":"IF(W215=0,\"\",IF(W215=S215,\"\",IF(W215>S215,\"dropped\",\"increased\")))","v":""}]
[{"$f":"Scores!A207","v":0},{"$f":"Scores!B207","v":0},{"$f":"Scores!C207","v":0},{"$f":"Scores!D207","v":0},{"$f":"Scores!E207","v":0},{"$f":"Scores!F207","v":0},{"$f":"Scores!G207","v":0},{"$f":"Scores!H207","v":0},{"$f":"Scores!I207","v":0},{"$f":"Scores!J207","v":0},{"$f":"Scores!K207","v":0},{"$f":"Scores!L207","v":0},{"$f":"Scores!M207","v":0},{"$f":"Scores!N207","v":0},{"$f":"Scores!O207","v":0},-0.70710678118654746,2.9512994231491119,2.9512994231491119,{"$f":"IF(R216<'Grading Scale'!G$8,IF(R216<'Grading Scale'!G$13,'Grading Scale'!E$13,IF(R216<'Grading Scale'!G$12,'Grading Scale'!E$11,IF(R216<'Grading Scale'!G$11,'Grading Scale'!E$9,IF(R216<'Grading Scale'!G$10,'Grading Scale'!E$7,IF(R216<'Grading Scale'!G$9,'Grading Scale'!E$5,'Grading Scale'!E$3))))),IF(R216<'Grading Scale'!G$7,'Grading Scale'!B$13,IF(R216<'Grading Scale'!G$6,'Grading Scale'!B$11,IF(R216<'Grading Scale'!G$5,'Grading Scale'!B$9,IF(R216<'Grading Scale'!G$4,'Grading Scale'!B$7,IF(R216<'Grading Scale'!G$3,'Grading Scale'!B$5,'Grading Scale'!B$3))))))","v":3},{"$f":"Scores!B207","v":0},{"$f":"IF(S216>='Grading Scale'!B$13,IF(S216='Grading Scale'!B$3,'Grading Scale'!C$3,IF(S216='Grading Scale'!B$5,'Grading Scale'!C$5,IF(S216='Grading Scale'!B$7,'Grading Scale'!C$7,IF(S216='Grading Scale'!B$9,'Grading Scale'!C$9,IF(S216='Grading Scale'!B$11,'Grading Scale'!C$11,'Grading Scale'!C$13))))),IF(S216='Grading Scale'!E$3,'Grading Scale'!F$3,IF(S216='Grading Scale'!E$5,'Grading Scale'!F$5,IF(S216='Grading Scale'!E$7,'Grading Scale'!F$7,IF(S216='Grading Scale'!E$9,'Grading Scale'!F$9,IF(S216='Grading Scale'!E$11,'Grading Scale'!F$11,'Grading Scale'!F$13))))))","v":"B    "}," ",null,""]
[{"$f":"Scores!A208","v":0},{"$f":"Scores!B208","v":0},{"$f":"Scores!C208","v":0},{"$f":"Scores!D208","v":0},{"$f":"Scores!E208","v":0},{"$f":"Scores!F208","v":0},{"$f":"Scores!G208","v":0},{"$f":"Scores!H208","v":0},{"$f":"Scores!I208","v":0},{"$f":"Scores!J208","v":0},{"$f":"Scores!K208","v":0},{"$f":"Scores!L208","v":0},{"$f":"Scores!M208","v":0},{"$f":"Scores!N208","v":0},{"$f":"Scores!O208","v":0},-0.70710678118654746,2.9512994231491119,2.9512994231491119,{"$f":"IF(R217<'Grading Scale'!G$8,IF(R217<'Grading Scale'!G$13,'Grading Scale'!E$13,IF(R217<'Grading Scale'!G$12,'Grading Scale'!E$11,IF(R217<'Grading Scale'!G$11,'Grading Scale'!E$9,IF(R217<'Grading Scale'!G$10,'Grading Scale'!E$7,IF(R217<'Grading Scale'!G$9,'Grading Scale'!E$5,'Grading Scale'!E$3))))),IF(R217<'Grading Scale'!G$7,'Grading Scale'!B$13,IF(R217<'Grading Scale'!G$6,'Grading Scale'!B$11,IF(R217<'Grading Scale'!G$5,'Grading Scale'!B$9,IF(R217<'Grading Scale'!G$4,'Grading Scale'!B$7,IF(R217<'Grading Scale'!G$3,'Grading Scale'!B$5,'Grading Scale'!B$3))))))","v":3},{"$f":"Scores!B208","v":0},{"$f":"IF(S217>='Grading Scale'!B$13,IF(S217='Grading Scale'!B$3,'Grading Scale'!C$3,IF(S217='Grading Scale'!B$5,'Grading Scale'!C$5,IF(S217='Grading Scale'!B$7,'Grading Scale'!C$7,IF(S217='Grading Scale'!B$9,'Grading Scale'!C$9,IF(S217='Grading Scale'!B$11,'Grading Scale'!C$11,'Grading Scale'!C$13))))),IF(S217='Grading Scale'!E$3,'Grading Scale'!F$3,IF(S217='Grading Scale'!E$5,'Grading Scale'!F$5,IF(S217='Grading Scale'!E$7,'Grading Scale'!F$7,IF(S217='Grading Scale'!E$9,'Grading Scale'!F$9,IF(S217='Grading Scale'!E$11,'Grading Scale'!F$11,'Grading Scale'!F$13))))))","v":"B    "}," ",null,""]
[{"$f":"Scores!A209","v":0},{"$f":"Scores!B209","v":0},{"$f":"Scores!C209","v":0},{"$f":"Scores!D209","v":0},{"$f":"Scores!E209","v":0},{"$f":"Scores!F209","v":0},{"$f":"Scores!G209","v":0},{"$f":"Scores!H209","v":0},{"$f":"Scores!I209","v":0},{"$f":"Scores!J209","v":0},{"$f":"Scores!K209","v":0},{"$f":"Scores!L209","v":0},{"$f":"Scores!M209","v":0},{"$f":"Scores!N209","v":0},{"$f":"Scores!O209","v":0},-0.70710678118654746,2.9512994231491119,2.9512994231491119,{"$f":"IF(R218<'Grading Scale'!G$8,IF(R218<'Grading Scale'!G$13,'Grading Scale'!E$13,IF(R218<'Grading Scale'!G$12,'Grading Scale'!E$11,IF(R218<'Grading Scale'!G$11,'Grading Scale'!E$9,IF(R218<'Grading Scale'!G$10,'Grading Scale'!E$7,IF(R218<'Grading Scale'!G$9,'Grading Scale'!E$5,'Grading Scale'!E$3))))),IF(R218<'Grading Scale'!G$7,'Grading Scale'!B$13,IF(R218<'Grading Scale'!G$6,'Grading Scale'!B$11,IF(R218<'Grading Scale'!G$5,'Grading Scale'!B$9,IF(R218<'Grading Scale'!G$4,'Grading Scale'!B$7,IF(R218<'Grading Scale'!G$3,'Grading Scale'!B$5,'Grading Scale'!B$3))))))","v":3},{"$f":"Scores!B209","v":0},{"$f":"IF(S218>='Grading Scale'!B$13,IF(S218='Grading Scale'!B$3,'Grading Scale'!C$3,IF(S218='Grading Scale'!B$5,'Grading Scale'!C$5,IF(S218='Grading Scale'!B$7,'Grading Scale'!C$7,IF(S218='Grading Scale'!B$9,'Grading Scale'!C$9,IF(S218='Grading Scale'!B$11,'Grading Scale'!C$11,'Grading Scale'!C$13))))),IF(S218='Grading Scale'!E$3,'Grading Scale'!F$3,IF(S218='Grading Scale'!E$5,'Grading Scale'!F$5,IF(S218='Grading Scale'!E$7,'Grading Scale'!F$7,IF(S218='Grading Scale'!E$9,'Grading Scale'!F$9,IF(S218='Grading Scale'!E$11,'Grading Scale'!F$11,'Grading Scale'!F$13))))))","v":"B    "}," ",null,""]
[{"$f":"Scores!A210","v":0},{"$f":"Scores!B210","v":0},{"$f":"Scores!C210","v":0},{"$f":"Scores!D210","v":0},{"$f":"Scores!E210","v":0},{"$f":"Scores!F210","v":0},{"$f":"Scores!G210","v":0},{"$f":"Scores!H210","v":0},{"$f":"Scores!I210","v":0},{"$f":"Scores!J210","v":0},{"$f":"Scores!K210","v":0},{"$f":"Scores!L210","v":0},{"$f":"Scores!M210","v":0},{"$f":"Scores!N210","v":0},{"$f":"Scores!O210","v":0},-0.70710678118654746,2.9512994231491119,2.9512994231491119,{"$f":"IF(R219<'Grading Scale'!G$8,IF(R219<'Grading Scale'!G$13,'Grading Scale'!E$13,IF(R219<'Grading Scale'!G$12,'Grading Scale'!E$11,IF(R219<'Grading Scale'!G$11,'Grading Scale'!E$9,IF(R219<'Grading Scale'!G$10,'Grading Scale'!E$7,IF(R219<'Grading Scale'!G$9,'Grading Scale'!E$5,'Grading Scale'!E$3))))),IF(R219<'Grading Scale'!G$7,'Grading Scale'!B$13,IF(R219<'Grading Scale'!G$6,'Grading Scale'!B$11,IF(R219<'Grading Scale'!G$5,'Grading Scale'!B$9,IF(R219<'Grading Scale'!G$4,'Grading Scale'!B$7,IF(R219<'Grading Scale'!G$3,'Grading Scale'!B$5,'Grading Scale'!B$3))))))","v":3},{"$f":"Scores!B210","v":0},{"$f":"IF(S219>='Grading Scale'!B$13,IF(S219='Grading Scale'!B$3,'Grading Scale'!C$3,IF(S219='Grading Scale'!B$5,'Grading Scale'!C$5,IF(S219='Grading Scale'!B$7,'Grading Scale'!C$7,IF(S219='Grading Scale'!B$9,'Grading Scale'!C$9,IF(S219='Grading Scale'!B$11,'Grading Scale'!C$11,'Grading Scale'!C$13))))),IF(S219='Grading Scale'!E$3,'Grading Scale'!F$3,IF(S219='Grading Scale'!E$5,'Grading Scale'!F$5,IF(S219='Grading Scale'!E$7,'Grading Scale'!F$7,IF(S219='Grading Scale'!E$9,'Grading Scale'!F$9,IF(S219='Grading Scale'!E$11,'Grading Scale'!F$11,'Grading Scale'!F$13))))))","v":"B    "}," ",null,""]
[{"$f":"Scores!A211","v":0},{"$f":"Scores!B211","v":0},{"$f":"Scores!C211","v":0},{"$f":"Scores!D211","v":0},{"$f":"Scores!E211","v":0},{"$f":"Scores!F211","v":0},{"$f":"Scores!G211","v":0},{"$f":"Scores!H211","v":0},{"$f":"Scores!I211","v":0},{"$f":"Scores!J211","v":0},{"$f":"Scores!K211","v":0},{"$f":"Scores!L211","v":0},{"$f":"Scores!M211","v":0},{"$f":"Scores!N211","v":0},{"$f":"Scores!O211","v":0},-0.70710678118654746,2.9512994231491119,2.9512994231491119,{"$f":"IF(R220<'Grading Scale'!G$8,IF(R220<'Grading Scale'!G$13,'Grading Scale'!E$13,IF(R220<'Grading Scale'!G$12,'Grading Scale'!E$11,IF(R220<'Grading Scale'!G$11,'Grading Scale'!E$9,IF(R220<'Grading Scale'!G$10,'Grading Scale'!E$7,IF(R220<'Grading Scale'!G$9,'Grading Scale'!E$5,'Grading Scale'!E$3))))),IF(R220<'Grading Scale'!G$7,'Grading Scale'!B$13,IF(R220<'Grading Scale'!G$6,'Grading Scale'!B$11,IF(R220<'Grading Scale'!G$5,'Grading Scale'!B$9,IF(R220<'Grading Scale'!G$4,'Grading Scale'!B$7,IF(R220<'Grading Scale'!G$3,'Grading Scale'!B$5,'Grading Scale'!B$3))))))","v":3},{"$f":"Scores!B211","v":0},{"$f":"IF(S220>='Grading Scale'!B$13,IF(S220='Grading Scale'!B$3,'Grading Scale'!C$3,IF(S220='Grading Scale'!B$5,'Grading Scale'!C$5,IF(S220='Grading Scale'!B$7,'Grading Scale'!C$7,IF(S220='Grading Scale'!B$9,'Grading Scale'!C$9,IF(S220='Grading Scale'!B$11,'Grading Scale'!C$11,'Grading Scale'!C$13))))),IF(S220='Grading Scale'!E$3,'Grading Scale'!F$3,IF(S220='Grading Scale'!E$5,'Grading Scale'!F$5,IF(S220='Grading Scale'!E$7,'Grading Scale'!F$7,IF(S220='Grading Scale'!E$9,'Grading Scale'!F$9,IF(S220='Grading Scale'!E$11,'Grading Scale'!F$11,'Grading Scale'!F$13))))))","v":"B    "}," ",null,""]
[{"$f":"Scores!A212","v":0},{"$f":"Scores!B212","v":0},{"$f":"Scores!C212","v":0},{"$f":"Scores!D212","v":0},{"$f":"Scores!E212","v":0},{"$f":"Scores!F212","v":0},{"$f":"Scores!G212","v":0},{"$f":"Scores!H212","v":0},{"$f":"Scores!I212","v":0},{"$f":"Scores!J212","v":0},{"$f":"Scores!K212","v":0},{"$f":"Scores!L212","v":0},{"$f":"Scores!M212","v":0},{"$f":"Scores!N212","v":0},{"$f":"Scores!O212","v":0},-0.70710678118654746,2.9512994231491119,2.9512994231491119,{"$f":"IF(R221<'Grading Scale'!G$8,IF(R221<'Grading Scale'!G$13,'Grading Scale'!E$13,IF(R221<'Grading Scale'!G$12,'Grading Scale'!E$11,IF(R221<'Grading Scale'!G$11,'Grading Scale'!E$9,IF(R221<'Grading Scale'!G$10,'Grading Scale'!E$7,IF(R221<'Grading Scale'!G$9,'Grading Scale'!E$5,'Grading Scale'!E$3))))),IF(R221<'Grading Scale'!G$7,'Grading Scale'!B$13,IF(R221<'Grading Scale'!G$6,'Grading Scale'!B$11,IF(R221<'Grading Scale'!G$5,'Grading Scale'!B$9,IF(R221<'Grading Scale'!G$4,'Grading Scale'!B$7,IF(R221<'Grading Scale'!G$3,'Grading Scale'!B$5,'Grading Scale'!B$3))))))","v":3},{"$f":"Scores!B212","v":0},{"$f":"IF(S221>='Grading Scale'!B$13,IF(S221='Grading Scale'!B$3,'Grading Scale'!C$3,IF(S221='Grading Scale'!B$5,'Grading Scale'!C$5,IF(S221='Grading Scale'!B$7,'Grading Scale'!C$7,IF(S221='Grading Scale'!B$9,'Grading Scale'!C$9,IF(S221='Grading Scale'!B$11,'Grading Scale'!C$11,'Grading Scale'!C$13))))),IF(S221='Grading Scale'!E$3,'Grading Scale'!F$3,IF(S221='Grading Scale'!E$5,'Grading Scale'!F$5,IF(S221='Grading Scale'!E$7,'Grading Scale'!F$7,IF(S221='Grading Scale'!E$9,'Grading Scale'!F$9,IF(S221='Grading Scale'!E$11,'Grading Scale'!F$11,'Grading Scale'!F$13))))))","v":"B    "}," ",null,""]
[{"$f":"Scores!A213","v":0},{"$f":"Scores!B213","v":0},{"$f":"Scores!C213","v":0},{"$f":"Scores!D213","v":0},{"$f":"Scores!E213","v":0},{"$f":"Scores!F213","v":0},{"$f":"Scores!G213","v":0},{"$f":"Scores!H213","v":0},{"$f":"Scores!I213","v":0},{"$f":"Scores!J213","v":0},{"$f":"Scores!K213","v":0},{"$f":"Scores!L213","v":0},{"$f":"Scores!M213","v":0},{"$f":"Scores!N213","v":0},{"$f":"Scores!O213","v":0},-0.70710678118654746,2.9512994231491119,2.9512994231491119,{"$f":"IF(R222<'Grading Scale'!G$8,IF(R222<'Grading Scale'!G$13,'Grading Scale'!E$13,IF(R222<'Grading Scale'!G$12,'Grading Scale'!E$11,IF(R222<'Grading Scale'!G$11,'Grading Scale'!E$9,IF(R222<'Grading Scale'!G$10,'Grading Scale'!E$7,IF(R222<'Grading Scale'!G$9,'Grading Scale'!E$5,'Grading Scale'!E$3))))),IF(R222<'Grading Scale'!G$7,'Grading Scale'!B$13,IF(R222<'Grading Scale'!G$6,'Grading Scale'!B$11,IF(R222<'Grading Scale'!G$5,'Grading Scale'!B$9,IF(R222<'Grading Scale'!G$4,'Grading Scale'!B$7,IF(R222<'Grading Scale'!G$3,'Grading Scale'!B$5,'Grading Scale'!B$3))))))","v":3},{"$f":"Scores!B213","v":0},{"$f":"IF(S222>='Grading Scale'!B$13,IF(S222='Grading Scale'!B$3,'Grading Scale'!C$3,IF(S222='Grading Scale'!B$5,'Grading Scale'!C$5,IF(S222='Grading Scale'!B$7,'Grading Scale'!C$7,IF(S222='Grading Scale'!B$9,'Grading Scale'!C$9,IF(S222='Grading Scale'!B$11,'Grading Scale'!C$11,'Grading Scale'!C$13))))),IF(S222='Grading Scale'!E$3,'Grading Scale'!F$3,IF(S222='Grading Scale'!E$5,'Grading Scale'!F$5,IF(S222='Grading Scale'!E$7,'Grading Scale'!F$7,IF(S222='Grading Scale'!E$9,'Grading Scale'!F$9,IF(S222='Grading Scale'!E$11,'Grading Scale'!F$11,'Grading Scale'!F$13))))))","v":"B    "}," ",null,""]
[{"$f":"Scores!A214","v":0},{"$f":"Scores!B214","v":0},{"$f":"Scores!C214","v":0},{"$f":"Scores!D214","v":0},{"$f":"Scores!E214","v":0},{"$f":"Scores!F214","v":0},{"$f":"Scores!G214","v":0},{"$f":"Scores!H214","v":0},{"$f":"Scores!I214","v":0},{"$f":"Scores!J214","v":0},{"$f":"Scores!K214","v":0},{"$f":"Scores!L214","v":0},{"$f":"Scores!M214","v":0},{"$f":"Scores!N214","v":0},{"$f":"Scores!O214","v":0},-0.70710678118654746,2.9512994231491119,2.9512994231491119,{"$f":"IF(R223<'Grading Scale'!G$8,IF(R223<'Grading Scale'!G$13,'Grading Scale'!E$13,IF(R223<'Grading Scale'!G$12,'Grading Scale'!E$11,IF(R223<'Grading Scale'!G$11,'Grading Scale'!E$9,IF(R223<'Grading Scale'!G$10,'Grading Scale'!E$7,IF(R223<'Grading Scale'!G$9,'Grading Scale'!E$5,'Grading Scale'!E$3))))),IF(R223<'Grading Scale'!G$7,'Grading Scale'!B$13,IF(R223<'Grading Scale'!G$6,'Grading Scale'!B$11,IF(R223<'Grading Scale'!G$5,'Grading Scale'!B$9,IF(R223<'Grading Scale'!G$4,'Grading Scale'!B$7,IF(R223<'Grading Scale'!G$3,'Grading Scale'!B$5,'Grading Scale'!B$3))))))","v":3},{"$f":"Scores!B214","v":0},{"$f":"IF(S223>='Grading Scale'!B$13,IF(S223='Grading Scale'!B$3,'Grading Scale'!C$3,IF(S223='Grading Scale'!B$5,'Grading Scale'!C$5,IF(S223='Grading Scale'!B$7,'Grading Scale'!C$7,IF(S223='Grading Scale'!B$9,'Grading Scale'!C$9,IF(S223='Grading Scale'!B$11,'Grading Scale'!C$11,'Grading Scale'!C$13))))),IF(S223='Grading Scale'!E$3,'Grading Scale'!F$3,IF(S223='Grading Scale'!E$5,'Grading Scale'!F$5,IF(S223='Grading Scale'!E$7,'Grading Scale'!F$7,IF(S223='Grading Scale'!E$9,'Grading Scale'!F$9,IF(S223='Grading Scale'!E$11,'Grading Scale'!F$11,'Grading Scale'!F$13))))))","v":"B    "}," ",null,""]
[{"$f":"Scores!A215","v":0},{"$f":"Scores!B215","v":0},{"$f":"Scores!C215","v":0},{"$f":"Scores!D215","v":0},{"$f":"Scores!E215","v":0},{"$f":"Scores!F215","v":0},{"$f":"Scores!G215","v":0},{"$f":"Scores!H215","v":0},{"$f":"Scores!I215","v":0},{"$f":"Scores!J215","v":0},{"$f":"Scores!K215","v":0},{"$f":"Scores!L215","v":0},{"$f":"Scores!M215","v":0},{"$f":"Scores!N215","v":0},{"$f":"Scores!O215","v":0},-0.70710678118654746,2.9512994231491119,2.9512994231491119,{"$f":"IF(R224<'Grading Scale'!G$8,IF(R224<'Grading Scale'!G$13,'Grading Scale'!E$13,IF(R224<'Grading Scale'!G$12,'Grading Scale'!E$11,IF(R224<'Grading Scale'!G$11,'Grading Scale'!E$9,IF(R224<'Grading Scale'!G$10,'Grading Scale'!E$7,IF(R224<'Grading Scale'!G$9,'Grading Scale'!E$5,'Grading Scale'!E$3))))),IF(R224<'Grading Scale'!G$7,'Grading Scale'!B$13,IF(R224<'Grading Scale'!G$6,'Grading Scale'!B$11,IF(R224<'Grading Scale'!G$5,'Grading Scale'!B$9,IF(R224<'Grading Scale'!G$4,'Grading Scale'!B$7,IF(R224<'Grading Scale'!G$3,'Grading Scale'!B$5,'Grading Scale'!B$3))))))","v":3},{"$f":"Scores!B215","v":0},{"$f":"IF(S224>='Grading Scale'!B$13,IF(S224='Grading Scale'!B$3,'Grading Scale'!C$3,IF(S224='Grading Scale'!B$5,'Grading Scale'!C$5,IF(S224='Grading Scale'!B$7,'Grading Scale'!C$7,IF(S224='Grading Scale'!B$9,'Grading Scale'!C$9,IF(S224='Grading Scale'!B$11,'Grading Scale'!C$11,'Grading Scale'!C$13))))),IF(S224='Grading Scale'!E$3,'Grading Scale'!F$3,IF(S224='Grading Scale'!E$5,'Grading Scale'!F$5,IF(S224='Grading Scale'!E$7,'Grading Scale'!F$7,IF(S224='Grading Scale'!E$9,'Grading Scale'!F$9,IF(S224='Grading Scale'!E$11,'Grading Scale'!F$11,'Grading Scale'!F$13))))))","v":"B    "}," ",null,""]
[{"$f":"Scores!A216","v":0},{"$f":"Scores!B216","v":0},{"$f":"Scores!C216","v":0},{"$f":"Scores!D216","v":0},{"$f":"Scores!E216","v":0},{"$f":"Scores!F216","v":0},{"$f":"Scores!G216","v":0},{"$f":"Scores!H216","v":0},{"$f":"Scores!I216","v":0},{"$f":"Scores!J216","v":0},{"$f":"Scores!K216","v":0},{"$f":"Scores!L216","v":0},{"$f":"Scores!M216","v":0},{"$f":"Scores!N216","v":0},{"$f":"Scores!O216","v":0},-0.70710678118654746,2.9512994231491119,2.9512994231491119,{"$f":"IF(R225<'Grading Scale'!G$8,IF(R225<'Grading Scale'!G$13,'Grading Scale'!E$13,IF(R225<'Grading Scale'!G$12,'Grading Scale'!E$11,IF(R225<'Grading Scale'!G$11,'Grading Scale'!E$9,IF(R225<'Grading Scale'!G$10,'Grading Scale'!E$7,IF(R225<'Grading Scale'!G$9,'Grading Scale'!E$5,'Grading Scale'!E$3))))),IF(R225<'Grading Scale'!G$7,'Grading Scale'!B$13,IF(R225<'Grading Scale'!G$6,'Grading Scale'!B$11,IF(R225<'Grading Scale'!G$5,'Grading Scale'!B$9,IF(R225<'Grading Scale'!G$4,'Grading Scale'!B$7,IF(R225<'Grading Scale'!G$3,'Grading Scale'!B$5,'Grading Scale'!B$3))))))","v":3},{"$f":"Scores!B216","v":0},{"$f":"IF(S225>='Grading Scale'!B$13,IF(S225='Grading Scale'!B$3,'Grading Scale'!C$3,IF(S225='Grading Scale'!B$5,'Grading Scale'!C$5,IF(S225='Grading Scale'!B$7,'Grading Scale'!C$7,IF(S225='Grading Scale'!B$9,'Grading Scale'!C$9,IF(S225='Grading Scale'!B$11,'Grading Scale'!C$11,'Grading Scale'!C$13))))),IF(S225='Grading Scale'!E$3,'Grading Scale'!F$3,IF(S225='Grading Scale'!E$5,'Grading Scale'!F$5,IF(S225='Grading Scale'!E$7,'Grading Scale'!F$7,IF(S225='Grading Scale'!E$9,'Grading Scale'!F$9,IF(S225='Grading Scale'!E$11,'Grading Scale'!F$11,'Grading Scale'!F$13))))))","v":"B    "}," ",null,""]
[{"$f":"Scores!A217","v":0},{"$f":"Scores!B217","v":0},{"$f":"Scores!C217","v":0},{"$f":"Scores!D217","v":0},{"$f":"Scores!E217","v":0},{"$f":"Scores!F217","v":0},{"$f":"Scores!G217","v":0},{"$f":"Scores!H217","v":0},{"$f":"Scores!I217","v":0},{"$f":"Scores!J217","v":0},{"$f":"Scores!K217","v":0},{"$f":"Scores!L217","v":0},{"$f":"Scores!M217","v":0},{"$f":"Scores!N217","v":0},{"$f":"Scores!O217","v":0},-0.70710678118654746,2.9512994231491119,2.9512994231491119,{"$f":"IF(R226<'Grading Scale'!G$8,IF(R226<'Grading Scale'!G$13,'Grading Scale'!E$13,IF(R226<'Grading Scale'!G$12,'Grading Scale'!E$11,IF(R226<'Grading Scale'!G$11,'Grading Scale'!E$9,IF(R226<'Grading Scale'!G$10,'Grading Scale'!E$7,IF(R226<'Grading Scale'!G$9,'Grading Scale'!E$5,'Grading Scale'!E$3))))),IF(R226<'Grading Scale'!G$7,'Grading Scale'!B$13,IF(R226<'Grading Scale'!G$6,'Grading Scale'!B$11,IF(R226<'Grading Scale'!G$5,'Grading Scale'!B$9,IF(R226<'Grading Scale'!G$4,'Grading Scale'!B$7,IF(R226<'Grading Scale'!G$3,'Grading Scale'!B$5,'Grading Scale'!B$3))))))","v":3},{"$f":"Scores!B217","v":0},{"$f":"IF(S226>='Grading Scale'!B$13,IF(S226='Grading Scale'!B$3,'Grading Scale'!C$3,IF(S226='Grading Scale'!B$5,'Grading Scale'!C$5,IF(S226='Grading Scale'!B$7,'Grading Scale'!C$7,IF(S226='Grading Scale'!B$9,'Grading Scale'!C$9,IF(S226='Grading Scale'!B$11,'Grading Scale'!C$11,'Grading Scale'!C$13))))),IF(S226='Grading Scale'!E$3,'Grading Scale'!F$3,IF(S226='Grading Scale'!E$5,'Grading Scale'!F$5,IF(S226='Grading Scale'!E$7,'Grading Scale'!F$7,IF(S226='Grading Scale'!E$9,'Grading Scale'!F$9,IF(S226='Grading Scale'!E$11,'Grading Scale'!F$11,'Grading Scale'!F$13))))))","v":"B    "}," ",null,""]
[{"$f":"Scores!A218","v":0},{"$f":"Scores!B218","v":0},{"$f":"Scores!C218","v":0},{"$f":"Scores!D218","v":0},{"$f":"Scores!E218","v":0},{"$f":"Scores!F218","v":0},{"$f":"Scores!G218","v":0},{"$f":"Scores!H218","v":0},{"$f":"Scores!I218","v":0},{"$f":"Scores!J218","v":0},{"$f":"Scores!K218","v":0},{"$f":"Scores!L218","v":0},{"$f":"Scores!M218","v":0},{"$f":"Scores!N218","v":0},{"$f":"Scores!O218","v":0},-0.70710678118654746,2.9512994231491119,2.9512994231491119,{"$f":"IF(R227<'Grading Scale'!G$8,IF(R227<'Grading Scale'!G$13,'Grading Scale'!E$13,IF(R227<'Grading Scale'!G$12,'Grading Scale'!E$11,IF(R227<'Grading Scale'!G$11,'Grading Scale'!E$9,IF(R227<'Grading Scale'!G$10,'Grading Scale'!E$7,IF(R227<'Grading Scale'!G$9,'Grading Scale'!E$5,'Grading Scale'!E$3))))),IF(R227<'Grading Scale'!G$7,'Grading Scale'!B$13,IF(R227<'Grading Scale'!G$6,'Grading Scale'!B$11,IF(R227<'Grading Scale'!G$5,'Grading Scale'!B$9,IF(R227<'Grading Scale'!G$4,'Grading Scale'!B$7,IF(R227<'Grading Scale'!G$3,'Grading Scale'!B$5,'Grading Scale'!B$3))))))","v":3},{"$f":"Scores!B218","v":0},{"$f":"IF(S227>='Grading Scale'!B$13,IF(S227='Grading Scale'!B$3,'Grading Scale'!C$3,IF(S227='Grading Scale'!B$5,'Grading Scale'!C$5,IF(S227='Grading Scale'!B$7,'Grading Scale'!C$7,IF(S227='Grading Scale'!B$9,'Grading Scale'!C$9,IF(S227='Grading Scale'!B$11,'Grading Scale'!C$11,'Grading Scale'!C$13))))),IF(S227='Grading Scale'!E$3,'Grading Scale'!F$3,IF(S227='Grading Scale'!E$5,'Grading Scale'!F$5,IF(S227='Grading Scale'!E$7,'Grading Scale'!F$7,IF(S227='Grading Scale'!E$9,'Grading Scale'!F$9,IF(S227='Grading Scale'!E$11,'Grading Scale'!F$11,'Grading Scale'!F$13))))))","v":"B    "}," ",null,""]
[{"$f":"Scores!A219","v":0},{"$f":"Scores!B219","v":0},{"$f":"Scores!C219","v":0},{"$f":"Scores!D219","v":0},{"$f":"Scores!E219","v":0},{"$f":"Scores!F219","v":0},{"$f":"Scores!G219","v":0},{"$f":"Scores!H219","v":0},{"$f":"Scores!I219","v":0},{"$f":"Scores!J219","v":0},{"$f":"Scores!K219","v":0},{"$f":"Scores!L219","v":0},{"$f":"Scores!M219","v":0},{"$f":"Scores!N219","v":0},{"$f":"Scores!O219","v":0},-0.70710678118654746,2.9512994231491119,2.9512994231491119,{"$f":"IF(R228<'Grading Scale'!G$8,IF(R228<'Grading Scale'!G$13,'Grading Scale'!E$13,IF(R228<'Grading Scale'!G$12,'Grading Scale'!E$11,IF(R228<'Grading Scale'!G$11,'Grading Scale'!E$9,IF(R228<'Grading Scale'!G$10,'Grading Scale'!E$7,IF(R228<'Grading Scale'!G$9,'Grading Scale'!E$5,'Grading Scale'!E$3))))),IF(R228<'Grading Scale'!G$7,'Grading Scale'!B$13,IF(R228<'Grading Scale'!G$6,'Grading Scale'!B$11,IF(R228<'Grading Scale'!G$5,'Grading Scale'!B$9,IF(R228<'Grading Scale'!G$4,'Grading Scale'!B$7,IF(R228<'Grading Scale'!G$3,'Grading Scale'!B$5,'Grading Scale'!B$3))))))","v":3},{"$f":"Scores!B219","v":0},{"$f":"IF(S228>='Grading Scale'!B$13,IF(S228='Grading Scale'!B$3,'Grading Scale'!C$3,IF(S228='Grading Scale'!B$5,'Grading Scale'!C$5,IF(S228='Grading Scale'!B$7,'Grading Scale'!C$7,IF(S228='Grading Scale'!B$9,'Grading Scale'!C$9,IF(S228='Grading Scale'!B$11,'Grading Scale'!C$11,'Grading Scale'!C$13))))),IF(S228='Grading Scale'!E$3,'Grading Scale'!F$3,IF(S228='Grading Scale'!E$5,'Grading Scale'!F$5,IF(S228='Grading Scale'!E$7,'Grading Scale'!F$7,IF(S228='Grading Scale'!E$9,'Grading Scale'!F$9,IF(S228='Grading Scale'!E$11,'Grading Scale'!F$11,'Grading Scale'!F$13))))))","v":"B    "}," ",null,""]
[{"$f":"Scores!A220","v":0},{"$f":"Scores!B220","v":0},{"$f":"Scores!C220","v":0},{"$f":"Scores!D220","v":0},{"$f":"Scores!E220","v":0},{"$f":"Scores!F220","v":0},{"$f":"Scores!G220","v":0},{"$f":"Scores!H220","v":0},{"$f":"Scores!I220","v":0},{"$f":"Scores!J220","v":0},{"$f":"Scores!K220","v":0},{"$f":"Scores!L220","v":0},{"$f":"Scores!M220","v":0},{"$f":"Scores!N220","v":0},{"$f":"Scores!O220","v":0},-0.70710678118654746,2.9512994231491119,2.9512994231491119,{"$f":"IF(R229<'Grading Scale'!G$8,IF(R229<'Grading Scale'!G$13,'Grading Scale'!E$13,IF(R229<'Grading Scale'!G$12,'Grading Scale'!E$11,IF(R229<'Grading Scale'!G$11,'Grading Scale'!E$9,IF(R229<'Grading Scale'!G$10,'Grading Scale'!E$7,IF(R229<'Grading Scale'!G$9,'Grading Scale'!E$5,'Grading Scale'!E$3))))),IF(R229<'Grading Scale'!G$7,'Grading Scale'!B$13,IF(R229<'Grading Scale'!G$6,'Grading Scale'!B$11,IF(R229<'Grading Scale'!G$5,'Grading Scale'!B$9,IF(R229<'Grading Scale'!G$4,'Grading Scale'!B$7,IF(R229<'Grading Scale'!G$3,'Grading Scale'!B$5,'Grading Scale'!B$3))))))","v":3},{"$f":"Scores!B220","v":0},{"$f":"IF(S229>='Grading Scale'!B$13,IF(S229='Grading Scale'!B$3,'Grading Scale'!C$3,IF(S229='Grading Scale'!B$5,'Grading Scale'!C$5,IF(S229='Grading Scale'!B$7,'Grading Scale'!C$7,IF(S229='Grading Scale'!B$9,'Grading Scale'!C$9,IF(S229='Grading Scale'!B$11,'Grading Scale'!C$11,'Grading Scale'!C$13))))),IF(S229='Grading Scale'!E$3,'Grading Scale'!F$3,IF(S229='Grading Scale'!E$5,'Grading Scale'!F$5,IF(S229='Grading Scale'!E$7,'Grading Scale'!F$7,IF(S229='Grading Scale'!E$9,'Grading Scale'!F$9,IF(S229='Grading Scale'!E$11,'Grading Scale'!F$11,'Grading Scale'!F$13))))))","v":"B    "}," ",null,""]
[{"$f":"Scores!A221","v":0},{"$f":"Scores!B221","v":0},{"$f":"Scores!C221","v":0},{"$f":"Scores!D221","v":0},{"$f":"Scores!E221","v":0},{"$f":"Scores!F221","v":0},{"$f":"Scores!G221","v":0},{"$f":"Scores!H221","v":0},{"$f":"Scores!I221","v":0},{"$f":"Scores!J221","v":0},{"$f":"Scores!K221","v":0},{"$f":"Scores!L221","v":0},{"$f":"Scores!M221","v":0},{"$f":"Scores!N221","v":0},{"$f":"Scores!O221","v":0},-0.70710678118654746,2.9512994231491119,2.9512994231491119,{"$f":"IF(R230<'Grading Scale'!G$8,IF(R230<'Grading Scale'!G$13,'Grading Scale'!E$13,IF(R230<'Grading Scale'!G$12,'Grading Scale'!E$11,IF(R230<'Grading Scale'!G$11,'Grading Scale'!E$9,IF(R230<'Grading Scale'!G$10,'Grading Scale'!E$7,IF(R230<'Grading Scale'!G$9,'Grading Scale'!E$5,'Grading Scale'!E$3))))),IF(R230<'Grading Scale'!G$7,'Grading Scale'!B$13,IF(R230<'Grading Scale'!G$6,'Grading Scale'!B$11,IF(R230<'Grading Scale'!G$5,'Grading Scale'!B$9,IF(R230<'Grading Scale'!G$4,'Grading Scale'!B$7,IF(R230<'Grading Scale'!G$3,'Grading Scale'!B$5,'Grading Scale'!B$3))))))","v":3},{"$f":"Scores!B221","v":0},{"$f":"IF(S230>='Grading Scale'!B$13,IF(S230='Grading Scale'!B$3,'Grading Scale'!C$3,IF(S230='Grading Scale'!B$5,'Grading Scale'!C$5,IF(S230='Grading Scale'!B$7,'Grading Scale'!C$7,IF(S230='Grading Scale'!B$9,'Grading Scale'!C$9,IF(S230='Grading Scale'!B$11,'Grading Scale'!C$11,'Grading Scale'!C$13))))),IF(S230='Grading Scale'!E$3,'Grading Scale'!F$3,IF(S230='Grading Scale'!E$5,'Grading Scale'!F$5,IF(S230='Grading Scale'!E$7,'Grading Scale'!F$7,IF(S230='Grading Scale'!E$9,'Grading Scale'!F$9,IF(S230='Grading Scale'!E$11,'Grading Scale'!F$11,'Grading Scale'!F$13))))))","v":"B    "}," ",null,""]
[{"$f":"Scores!A222","v":0},{"$f":"Scores!B222","v":0},{"$f":"Scores!C222","v":0},{"$f":"Scores!D222","v":0},{"$f":"Scores!E222","v":0},{"$f":"Scores!F222","v":0},{"$f":"Scores!G222","v":0},{"$f":"Scores!H222","v":0},{"$f":"Scores!I222","v":0},{"$f":"Scores!J222","v":0},{"$f":"Scores!K222","v":0},{"$f":"Scores!L222","v":0},{"$f":"Scores!M222","v":0},{"$f":"Scores!N222","v":0},{"$f":"Scores!O222","v":0},-0.70710678118654746,2.9512994231491119,2.9512994231491119,{"$f":"IF(R231<'Grading Scale'!G$8,IF(R231<'Grading Scale'!G$13,'Grading Scale'!E$13,IF(R231<'Grading Scale'!G$12,'Grading Scale'!E$11,IF(R231<'Grading Scale'!G$11,'Grading Scale'!E$9,IF(R231<'Grading Scale'!G$10,'Grading Scale'!E$7,IF(R231<'Grading Scale'!G$9,'Grading Scale'!E$5,'Grading Scale'!E$3))))),IF(R231<'Grading Scale'!G$7,'Grading Scale'!B$13,IF(R231<'Grading Scale'!G$6,'Grading Scale'!B$11,IF(R231<'Grading Scale'!G$5,'Grading Scale'!B$9,IF(R231<'Grading Scale'!G$4,'Grading Scale'!B$7,IF(R231<'Grading Scale'!G$3,'Grading Scale'!B$5,'Grading Scale'!B$3))))))","v":3},{"$f":"Scores!B222","v":0},{"$f":"IF(S231>='Grading Scale'!B$13,IF(S231='Grading Scale'!B$3,'Grading Scale'!C$3,IF(S231='Grading Scale'!B$5,'Grading Scale'!C$5,IF(S231='Grading Scale'!B$7,'Grading Scale'!C$7,IF(S231='Grading Scale'!B$9,'Grading Scale'!C$9,IF(S231='Grading Scale'!B$11,'Grading Scale'!C$11,'Grading Scale'!C$13))))),IF(S231='Grading Scale'!E$3,'Grading Scale'!F$3,IF(S231='Grading Scale'!E$5,'Grading Scale'!F$5,IF(S231='Grading Scale'!E$7,'Grading Scale'!F$7,IF(S231='Grading Scale'!E$9,'Grading Scale'!F$9,IF(S231='Grading Scale'!E$11,'Grading Scale'!F$11,'Grading Scale'!F$13))))))","v":"B    "}," ",null,""]
[{"$f":"Scores!A223","v":0},{"$f":"Scores!B223","v":0},{"$f":"Scores!C223","v":0},{"$f":"Scores!D223","v":0},{"$f":"Scores!E223","v":0},{"$f":"Scores!F223","v":0},{"$f":"Scores!G223","v":0},{"$f":"Scores!H223","v":0},{"$f":"Scores!I223","v":0},{"$f":"Scores!J223","v":0},{"$f":"Scores!K223","v":0},{"$f":"Scores!L223","v":0},{"$f":"Scores!M223","v":0},{"$f":"Scores!N223","v":0},{"$f":"Scores!O223","v":0},-0.70710678118654746,2.9512994231491119,2.9512994231491119,{"$f":"IF(R232<'Grading Scale'!G$8,IF(R232<'Grading Scale'!G$13,'Grading Scale'!E$13,IF(R232<'Grading Scale'!G$12,'Grading Scale'!E$11,IF(R232<'Grading Scale'!G$11,'Grading Scale'!E$9,IF(R232<'Grading Scale'!G$10,'Grading Scale'!E$7,IF(R232<'Grading Scale'!G$9,'Grading Scale'!E$5,'Grading Scale'!E$3))))),IF(R232<'Grading Scale'!G$7,'Grading Scale'!B$13,IF(R232<'Grading Scale'!G$6,'Grading Scale'!B$11,IF(R232<'Grading Scale'!G$5,'Grading Scale'!B$9,IF(R232<'Grading Scale'!G$4,'Grading Scale'!B$7,IF(R232<'Grading Scale'!G$3,'Grading Scale'!B$5,'Grading Scale'!B$3))))))","v":3},{"$f":"Scores!B223","v":0},{"$f":"IF(S232>='Grading Scale'!B$13,IF(S232='Grading Scale'!B$3,'Grading Scale'!C$3,IF(S232='Grading Scale'!B$5,'Grading Scale'!C$5,IF(S232='Grading Scale'!B$7,'Grading Scale'!C$7,IF(S232='Grading Scale'!B$9,'Grading Scale'!C$9,IF(S232='Grading Scale'!B$11,'Grading Scale'!C$11,'Grading Scale'!C$13))))),IF(S232='Grading Scale'!E$3,'Grading Scale'!F$3,IF(S232='Grading Scale'!E$5,'Grading Scale'!F$5,IF(S232='Grading Scale'!E$7,'Grading Scale'!F$7,IF(S232='Grading Scale'!E$9,'Grading Scale'!F$9,IF(S232='Grading Scale'!E$11,'Grading Scale'!F$11,'Grading Scale'!F$13))))))","v":"B    "}," ",null,""]
[{"$f":"Scores!A224","v":0},{"$f":"Scores!B224","v":0},{"$f":"Scores!C224","v":0},{"$f":"Scores!D224","v":0},{"$f":"Scores!E224","v":0},{"$f":"Scores!F224","v":0},{"$f":"Scores!G224","v":0},{"$f":"Scores!H224","v":0},{"$f":"Scores!I224","v":0},{"$f":"Scores!J224","v":0},{"$f":"Scores!K224","v":0},{"$f":"Scores!L224","v":0},{"$f":"Scores!M224","v":0},{"$f":"Scores!N224","v":0},{"$f":"Scores!O224","v":0},-0.70710678118654746,2.9512994231491119,2.9512994231491119,{"$f":"IF(R233<'Grading Scale'!G$8,IF(R233<'Grading Scale'!G$13,'Grading Scale'!E$13,IF(R233<'Grading Scale'!G$12,'Grading Scale'!E$11,IF(R233<'Grading Scale'!G$11,'Grading Scale'!E$9,IF(R233<'Grading Scale'!G$10,'Grading Scale'!E$7,IF(R233<'Grading Scale'!G$9,'Grading Scale'!E$5,'Grading Scale'!E$3))))),IF(R233<'Grading Scale'!G$7,'Grading Scale'!B$13,IF(R233<'Grading Scale'!G$6,'Grading Scale'!B$11,IF(R233<'Grading Scale'!G$5,'Grading Scale'!B$9,IF(R233<'Grading Scale'!G$4,'Grading Scale'!B$7,IF(R233<'Grading Scale'!G$3,'Grading Scale'!B$5,'Grading Scale'!B$3))))))","v":3},{"$f":"Scores!B224","v":0},{"$f":"IF(S233>='Grading Scale'!B$13,IF(S233='Grading Scale'!B$3,'Grading Scale'!C$3,IF(S233='Grading Scale'!B$5,'Grading Scale'!C$5,IF(S233='Grading Scale'!B$7,'Grading Scale'!C$7,IF(S233='Grading Scale'!B$9,'Grading Scale'!C$9,IF(S233='Grading Scale'!B$11,'Grading Scale'!C$11,'Grading Scale'!C$13))))),IF(S233='Grading Scale'!E$3,'Grading Scale'!F$3,IF(S233='Grading Scale'!E$5,'Grading Scale'!F$5,IF(S233='Grading Scale'!E$7,'Grading Scale'!F$7,IF(S233='Grading Scale'!E$9,'Grading Scale'!F$9,IF(S233='Grading Scale'!E$11,'Grading Scale'!F$11,'Grading Scale'!F$13))))))","v":"B    "}," ",null,""]
[{"$f":"Scores!A225","v":0},{"$f":"Scores!B225","v":0},{"$f":"Scores!C225","v":0},{"$f":"Scores!D225","v":0},{"$f":"Scores!E225","v":0},{"$f":"Scores!F225","v":0},{"$f":"Scores!G225","v":0},{"$f":"Scores!H225","v":0},{"$f":"Scores!I225","v":0},{"$f":"Scores!J225","v":0},{"$f":"Scores!K225","v":0},{"$f":"Scores!L225","v":0},{"$f":"Scores!M225","v":0},{"$f":"Scores!N225","v":0},{"$f":"Scores!O225","v":0},-0.70710678118654746,2.9512994231491119,2.9512994231491119,{"$f":"IF(R234<'Grading Scale'!G$8,IF(R234<'Grading Scale'!G$13,'Grading Scale'!E$13,IF(R234<'Grading Scale'!G$12,'Grading Scale'!E$11,IF(R234<'Grading Scale'!G$11,'Grading Scale'!E$9,IF(R234<'Grading Scale'!G$10,'Grading Scale'!E$7,IF(R234<'Grading Scale'!G$9,'Grading Scale'!E$5,'Grading Scale'!E$3))))),IF(R234<'Grading Scale'!G$7,'Grading Scale'!B$13,IF(R234<'Grading Scale'!G$6,'Grading Scale'!B$11,IF(R234<'Grading Scale'!G$5,'Grading Scale'!B$9,IF(R234<'Grading Scale'!G$4,'Grading Scale'!B$7,IF(R234<'Grading Scale'!G$3,'Grading Scale'!B$5,'Grading Scale'!B$3))))))","v":3},{"$f":"Scores!B225","v":0},{"$f":"IF(S234>='Grading Scale'!B$13,IF(S234='Grading Scale'!B$3,'Grading Scale'!C$3,IF(S234='Grading Scale'!B$5,'Grading Scale'!C$5,IF(S234='Grading Scale'!B$7,'Grading Scale'!C$7,IF(S234='Grading Scale'!B$9,'Grading Scale'!C$9,IF(S234='Grading Scale'!B$11,'Grading Scale'!C$11,'Grading Scale'!C$13))))),IF(S234='Grading Scale'!E$3,'Grading Scale'!F$3,IF(S234='Grading Scale'!E$5,'Grading Scale'!F$5,IF(S234='Grading Scale'!E$7,'Grading Scale'!F$7,IF(S234='Grading Scale'!E$9,'Grading Scale'!F$9,IF(S234='Grading Scale'!E$11,'Grading Scale'!F$11,'Grading Scale'!F$13))))))","v":"B    "}," ",null,""]
[{"$f":"Scores!A226","v":0},{"$f":"Scores!B226","v":0},{"$f":"Scores!C226","v":0},{"$f":"Scores!D226","v":0},{"$f":"Scores!E226","v":0},{"$f":"Scores!F226","v":0},{"$f":"Scores!G226","v":0},{"$f":"Scores!H226","v":0},{"$f":"Scores!I226","v":0},{"$f":"Scores!J226","v":0},{"$f":"Scores!K226","v":0},{"$f":"Scores!L226","v":0},{"$f":"Scores!M226","v":0},{"$f":"Scores!N226","v":0},{"$f":"Scores!O226","v":0},-0.70710678118654746,2.9512994231491119,2.9512994231491119,{"$f":"IF(R235<'Grading Scale'!G$8,IF(R235<'Grading Scale'!G$13,'Grading Scale'!E$13,IF(R235<'Grading Scale'!G$12,'Grading Scale'!E$11,IF(R235<'Grading Scale'!G$11,'Grading Scale'!E$9,IF(R235<'Grading Scale'!G$10,'Grading Scale'!E$7,IF(R235<'Grading Scale'!G$9,'Grading Scale'!E$5,'Grading Scale'!E$3))))),IF(R235<'Grading Scale'!G$7,'Grading Scale'!B$13,IF(R235<'Grading Scale'!G$6,'Grading Scale'!B$11,IF(R235<'Grading Scale'!G$5,'Grading Scale'!B$9,IF(R235<'Grading Scale'!G$4,'Grading Scale'!B$7,IF(R235<'Grading Scale'!G$3,'Grading Scale'!B$5,'Grading Scale'!B$3))))))","v":3},{"$f":"Scores!B226","v":0},{"$f":"IF(S235>='Grading Scale'!B$13,IF(S235='Grading Scale'!B$3,'Grading Scale'!C$3,IF(S235='Grading Scale'!B$5,'Grading Scale'!C$5,IF(S235='Grading Scale'!B$7,'Grading Scale'!C$7,IF(S235='Grading Scale'!B$9,'Grading Scale'!C$9,IF(S235='Grading Scale'!B$11,'Grading Scale'!C$11,'Grading Scale'!C$13))))),IF(S235='Grading Scale'!E$3,'Grading Scale'!F$3,IF(S235='Grading Scale'!E$5,'Grading Scale'!F$5,IF(S235='Grading Scale'!E$7,'Grading Scale'!F$7,IF(S235='Grading Scale'!E$9,'Grading Scale'!F$9,IF(S235='Grading Scale'!E$11,'Grading Scale'!F$11,'Grading Scale'!F$13))))))","v":"B    "}," ",null,""]
[{"$f":"Scores!A227","v":0},{"$f":"Scores!B227","v":0},{"$f":"Scores!C227","v":0},{"$f":"Scores!D227","v":0},{"$f":"Scores!E227","v":0},{"$f":"Scores!F227","v":0},{"$f":"Scores!G227","v":0},{"$f":"Scores!H227","v":0},{"$f":"Scores!I227","v":0},{"$f":"Scores!J227","v":0},{"$f":"Scores!K227","v":0},{"$f":"Scores!L227","v":0},{"$f":"Scores!M227","v":0},{"$f":"Scores!N227","v":0},{"$f":"Scores!O227","v":0},-0.70710678118654746,2.9512994231491119,2.9512994231491119,{"$f":"IF(R236<'Grading Scale'!G$8,IF(R236<'Grading Scale'!G$13,'Grading Scale'!E$13,IF(R236<'Grading Scale'!G$12,'Grading Scale'!E$11,IF(R236<'Grading Scale'!G$11,'Grading Scale'!E$9,IF(R236<'Grading Scale'!G$10,'Grading Scale'!E$7,IF(R236<'Grading Scale'!G$9,'Grading Scale'!E$5,'Grading Scale'!E$3))))),IF(R236<'Grading Scale'!G$7,'Grading Scale'!B$13,IF(R236<'Grading Scale'!G$6,'Grading Scale'!B$11,IF(R236<'Grading Scale'!G$5,'Grading Scale'!B$9,IF(R236<'Grading Scale'!G$4,'Grading Scale'!B$7,IF(R236<'Grading Scale'!G$3,'Grading Scale'!B$5,'Grading Scale'!B$3))))))","v":3},{"$f":"Scores!B227","v":0},{"$f":"IF(S236>='Grading Scale'!B$13,IF(S236='Grading Scale'!B$3,'Grading Scale'!C$3,IF(S236='Grading Scale'!B$5,'Grading Scale'!C$5,IF(S236='Grading Scale'!B$7,'Grading Scale'!C$7,IF(S236='Grading Scale'!B$9,'Grading Scale'!C$9,IF(S236='Grading Scale'!B$11,'Grading Scale'!C$11,'Grading Scale'!C$13))))),IF(S236='Grading Scale'!E$3,'Grading Scale'!F$3,IF(S236='Grading Scale'!E$5,'Grading Scale'!F$5,IF(S236='Grading Scale'!E$7,'Grading Scale'!F$7,IF(S236='Grading Scale'!E$9,'Grading Scale'!F$9,IF(S236='Grading Scale'!E$11,'Grading Scale'!F$11,'Grading Scale'!F$13))))))","v":"B    "}," ",null,""]
[{"$f":"Scores!A228","v":0},{"$f":"Scores!B228","v":0},{"$f":"Scores!C228","v":0},{"$f":"Scores!D228","v":0},{"$f":"Scores!E228","v":0},{"$f":"Scores!F228","v":0},{"$f":"Scores!G228","v":0},{"$f":"Scores!H228","v":0},{"$f":"Scores!I228","v":0},{"$f":"Scores!J228","v":0},{"$f":"Scores!K228","v":0},{"$f":"Scores!L228","v":0},{"$f":"Scores!M228","v":0},{"$f":"Scores!N228","v":0},{"$f":"Scores!O228","v":0},-0.70710678118654746,2.9512994231491119,2.9512994231491119,{"$f":"IF(R237<'Grading Scale'!G$8,IF(R237<'Grading Scale'!G$13,'Grading Scale'!E$13,IF(R237<'Grading Scale'!G$12,'Grading Scale'!E$11,IF(R237<'Grading Scale'!G$11,'Grading Scale'!E$9,IF(R237<'Grading Scale'!G$10,'Grading Scale'!E$7,IF(R237<'Grading Scale'!G$9,'Grading Scale'!E$5,'Grading Scale'!E$3))))),IF(R237<'Grading Scale'!G$7,'Grading Scale'!B$13,IF(R237<'Grading Scale'!G$6,'Grading Scale'!B$11,IF(R237<'Grading Scale'!G$5,'Grading Scale'!B$9,IF(R237<'Grading Scale'!G$4,'Grading Scale'!B$7,IF(R237<'Grading Scale'!G$3,'Grading Scale'!B$5,'Grading Scale'!B$3))))))","v":3},{"$f":"Scores!B228","v":0},{"$f":"IF(S237>='Grading Scale'!B$13,IF(S237='Grading Scale'!B$3,'Grading Scale'!C$3,IF(S237='Grading Scale'!B$5,'Grading Scale'!C$5,IF(S237='Grading Scale'!B$7,'Grading Scale'!C$7,IF(S237='Grading Scale'!B$9,'Grading Scale'!C$9,IF(S237='Grading Scale'!B$11,'Grading Scale'!C$11,'Grading Scale'!C$13))))),IF(S237='Grading Scale'!E$3,'Grading Scale'!F$3,IF(S237='Grading Scale'!E$5,'Grading Scale'!F$5,IF(S237='Grading Scale'!E$7,'Grading Scale'!F$7,IF(S237='Grading Scale'!E$9,'Grading Scale'!F$9,IF(S237='Grading Scale'!E$11,'Grading Scale'!F$11,'Grading Scale'!F$13))))))","v":"B    "}," ",null,""]
[{"$f":"Scores!A229","v":0},{"$f":"Scores!B229","v":0},{"$f":"Scores!C229","v":0},{"$f":"Scores!D229","v":0},{"$f":"Scores!E229","v":0},{"$f":"Scores!F229","v":0},{"$f":"Scores!G229","v":0},{"$f":"Scores!H229","v":0},{"$f":"Scores!I229","v":0},{"$f":"Scores!J229","v":0},{"$f":"Scores!K229","v":0},{"$f":"Scores!L229","v":0},{"$f":"Scores!M229","v":0},{"$f":"Scores!N229","v":0},{"$f":"Scores!O229","v":0},-0.70710678118654746,2.9512994231491119,2.9512994231491119,{"$f":"IF(R238<'Grading Scale'!G$8,IF(R238<'Grading Scale'!G$13,'Grading Scale'!E$13,IF(R238<'Grading Scale'!G$12,'Grading Scale'!E$11,IF(R238<'Grading Scale'!G$11,'Grading Scale'!E$9,IF(R238<'Grading Scale'!G$10,'Grading Scale'!E$7,IF(R238<'Grading Scale'!G$9,'Grading Scale'!E$5,'Grading Scale'!E$3))))),IF(R238<'Grading Scale'!G$7,'Grading Scale'!B$13,IF(R238<'Grading Scale'!G$6,'Grading Scale'!B$11,IF(R238<'Grading Scale'!G$5,'Grading Scale'!B$9,IF(R238<'Grading Scale'!G$4,'Grading Scale'!B$7,IF(R238<'Grading Scale'!G$3,'Grading Scale'!B$5,'Grading Scale'!B$3))))))","v":3},{"$f":"Scores!B229","v":0},{"$f":"IF(S238>='Grading Scale'!B$13,IF(S238='Grading Scale'!B$3,'Grading Scale'!C$3,IF(S238='Grading Scale'!B$5,'Grading Scale'!C$5,IF(S238='Grading Scale'!B$7,'Grading Scale'!C$7,IF(S238='Grading Scale'!B$9,'Grading Scale'!C$9,IF(S238='Grading Scale'!B$11,'Grading Scale'!C$11,'Grading Scale'!C$13))))),IF(S238='Grading Scale'!E$3,'Grading Scale'!F$3,IF(S238='Grading Scale'!E$5,'Grading Scale'!F$5,IF(S238='Grading Scale'!E$7,'Grading Scale'!F$7,IF(S238='Grading Scale'!E$9,'Grading Scale'!F$9,IF(S238='Grading Scale'!E$11,'Grading Scale'!F$11,'Grading Scale'!F$13))))))","v":"B    "}," ",null,""]
[{"$f":"Scores!A230","v":0},{"$f":"Scores!B230","v":0},{"$f":"Scores!C230","v":0},{"$f":"Scores!D230","v":0},{"$f":"Scores!E230","v":0},{"$f":"Scores!F230","v":0},{"$f":"Scores!G230","v":0},{"$f":"Scores!H230","v":0},{"$f":"Scores!I230","v":0},{"$f":"Scores!J230","v":0},{"$f":"Scores!K230","v":0},{"$f":"Scores!L230","v":0},{"$f":"Scores!M230","v":0},{"$f":"Scores!N230","v":0},{"$f":"Scores!O230","v":0},-0.70710678118654746,2.9512994231491119,2.9512994231491119,{"$f":"IF(R239<'Grading Scale'!G$8,IF(R239<'Grading Scale'!G$13,'Grading Scale'!E$13,IF(R239<'Grading Scale'!G$12,'Grading Scale'!E$11,IF(R239<'Grading Scale'!G$11,'Grading Scale'!E$9,IF(R239<'Grading Scale'!G$10,'Grading Scale'!E$7,IF(R239<'Grading Scale'!G$9,'Grading Scale'!E$5,'Grading Scale'!E$3))))),IF(R239<'Grading Scale'!G$7,'Grading Scale'!B$13,IF(R239<'Grading Scale'!G$6,'Grading Scale'!B$11,IF(R239<'Grading Scale'!G$5,'Grading Scale'!B$9,IF(R239<'Grading Scale'!G$4,'Grading Scale'!B$7,IF(R239<'Grading Scale'!G$3,'Grading Scale'!B$5,'Grading Scale'!B$3))))))","v":3},{"$f":"Scores!B230","v":0},{"$f":"IF(S239>='Grading Scale'!B$13,IF(S239='Grading Scale'!B$3,'Grading Scale'!C$3,IF(S239='Grading Scale'!B$5,'Grading Scale'!C$5,IF(S239='Grading Scale'!B$7,'Grading Scale'!C$7,IF(S239='Grading Scale'!B$9,'Grading Scale'!C$9,IF(S239='Grading Scale'!B$11,'Grading Scale'!C$11,'Grading Scale'!C$13))))),IF(S239='Grading Scale'!E$3,'Grading Scale'!F$3,IF(S239='Grading Scale'!E$5,'Grading Scale'!F$5,IF(S239='Grading Scale'!E$7,'Grading Scale'!F$7,IF(S239='Grading Scale'!E$9,'Grading Scale'!F$9,IF(S239='Grading Scale'!E$11,'Grading Scale'!F$11,'Grading Scale'!F$13))))))","v":"B    "}," ",null,""]
[{"$f":"Scores!A231","v":0},{"$f":"Scores!B231","v":0},{"$f":"Scores!C231","v":0},{"$f":"Scores!D231","v":0},{"$f":"Scores!E231","v":0},{"$f":"Scores!F231","v":0},{"$f":"Scores!G231","v":0},{"$f":"Scores!H231","v":0},{"$f":"Scores!I231","v":0},{"$f":"Scores!J231","v":0},{"$f":"Scores!K231","v":0},{"$f":"Scores!L231","v":0},{"$f":"Scores!M231","v":0},{"$f":"Scores!N231","v":0},{"$f":"Scores!O231","v":0},-0.70710678118654746,2.9512994231491119,2.9512994231491119,{"$f":"IF(R240<'Grading Scale'!G$8,IF(R240<'Grading Scale'!G$13,'Grading Scale'!E$13,IF(R240<'Grading Scale'!G$12,'Grading Scale'!E$11,IF(R240<'Grading Scale'!G$11,'Grading Scale'!E$9,IF(R240<'Grading Scale'!G$10,'Grading Scale'!E$7,IF(R240<'Grading Scale'!G$9,'Grading Scale'!E$5,'Grading Scale'!E$3))))),IF(R240<'Grading Scale'!G$7,'Grading Scale'!B$13,IF(R240<'Grading Scale'!G$6,'Grading Scale'!B$11,IF(R240<'Grading Scale'!G$5,'Grading Scale'!B$9,IF(R240<'Grading Scale'!G$4,'Grading Scale'!B$7,IF(R240<'Grading Scale'!G$3,'Grading Scale'!B$5,'Grading Scale'!B$3))))))","v":3},{"$f":"Scores!B231","v":0},{"$f":"IF(S240>='Grading Scale'!B$13,IF(S240='Grading Scale'!B$3,'Grading Scale'!C$3,IF(S240='Grading Scale'!B$5,'Grading Scale'!C$5,IF(S240='Grading Scale'!B$7,'Grading Scale'!C$7,IF(S240='Grading Scale'!B$9,'Grading Scale'!C$9,IF(S240='Grading Scale'!B$11,'Grading Scale'!C$11,'Grading Scale'!C$13))))),IF(S240='Grading Scale'!E$3,'Grading Scale'!F$3,IF(S240='Grading Scale'!E$5,'Grading Scale'!F$5,IF(S240='Grading Scale'!E$7,'Grading Scale'!F$7,IF(S240='Grading Scale'!E$9,'Grading Scale'!F$9,IF(S240='Grading Scale'!E$11,'Grading Scale'!F$11,'Grading Scale'!F$13))))))","v":"B    "}," ",null,""]
[{"$f":"Scores!A232","v":0},{"$f":"Scores!B232","v":0},{"$f":"Scores!C232","v":0},{"$f":"Scores!D232","v":0},{"$f":"Scores!E232","v":0},{"$f":"Scores!F232","v":0},{"$f":"Scores!G232","v":0},{"$f":"Scores!H232","v":0},{"$f":"Scores!I232","v":0},{"$f":"Scores!J232","v":0},{"$f":"Scores!K232","v":0},{"$f":"Scores!L232","v":0},{"$f":"Scores!M232","v":0},{"$f":"Scores!N232","v":0},{"$f":"Scores!O232","v":0},-0.70710678118654746,2.9512994231491119,2.9512994231491119,{"$f":"IF(R241<'Grading Scale'!G$8,IF(R241<'Grading Scale'!G$13,'Grading Scale'!E$13,IF(R241<'Grading Scale'!G$12,'Grading Scale'!E$11,IF(R241<'Grading Scale'!G$11,'Grading Scale'!E$9,IF(R241<'Grading Scale'!G$10,'Grading Scale'!E$7,IF(R241<'Grading Scale'!G$9,'Grading Scale'!E$5,'Grading Scale'!E$3))))),IF(R241<'Grading Scale'!G$7,'Grading Scale'!B$13,IF(R241<'Grading Scale'!G$6,'Grading Scale'!B$11,IF(R241<'Grading Scale'!G$5,'Grading Scale'!B$9,IF(R241<'Grading Scale'!G$4,'Grading Scale'!B$7,IF(R241<'Grading Scale'!G$3,'Grading Scale'!B$5,'Grading Scale'!B$3))))))","v":3},{"$f":"Scores!B232","v":0},{"$f":"IF(S241>='Grading Scale'!B$13,IF(S241='Grading Scale'!B$3,'Grading Scale'!C$3,IF(S241='Grading Scale'!B$5,'Grading Scale'!C$5,IF(S241='Grading Scale'!B$7,'Grading Scale'!C$7,IF(S241='Grading Scale'!B$9,'Grading Scale'!C$9,IF(S241='Grading Scale'!B$11,'Grading Scale'!C$11,'Grading Scale'!C$13))))),IF(S241='Grading Scale'!E$3,'Grading Scale'!F$3,IF(S241='Grading Scale'!E$5,'Grading Scale'!F$5,IF(S241='Grading Scale'!E$7,'Grading Scale'!F$7,IF(S241='Grading Scale'!E$9,'Grading Scale'!F$9,IF(S241='Grading Scale'!E$11,'Grading Scale'!F$11,'Grading Scale'!F$13))))))","v":"B    "}," ",null,""]
[{"$f":"Scores!A233","v":0},{"$f":"Scores!B233","v":0},{"$f":"Scores!C233","v":0},{"$f":"Scores!D233","v":0},{"$f":"Scores!E233","v":0},{"$f":"Scores!F233","v":0},{"$f":"Scores!G233","v":0},{"$f":"Scores!H233","v":0},{"$f":"Scores!I233","v":0},{"$f":"Scores!J233","v":0},{"$f":"Scores!K233","v":0},{"$f":"Scores!L233","v":0},{"$f":"Scores!M233","v":0},{"$f":"Scores!N233","v":0},{"$f":"Scores!O233","v":0},-0.70710678118654746,2.9512994231491119,2.9512994231491119,{"$f":"IF(R242<'Grading Scale'!G$8,IF(R242<'Grading Scale'!G$13,'Grading Scale'!E$13,IF(R242<'Grading Scale'!G$12,'Grading Scale'!E$11,IF(R242<'Grading Scale'!G$11,'Grading Scale'!E$9,IF(R242<'Grading Scale'!G$10,'Grading Scale'!E$7,IF(R242<'Grading Scale'!G$9,'Grading Scale'!E$5,'Grading Scale'!E$3))))),IF(R242<'Grading Scale'!G$7,'Grading Scale'!B$13,IF(R242<'Grading Scale'!G$6,'Grading Scale'!B$11,IF(R242<'Grading Scale'!G$5,'Grading Scale'!B$9,IF(R242<'Grading Scale'!G$4,'Grading Scale'!B$7,IF(R242<'Grading Scale'!G$3,'Grading Scale'!B$5,'Grading Scale'!B$3))))))","v":3},{"$f":"Scores!B233","v":0},{"$f":"IF(S242>='Grading Scale'!B$13,IF(S242='Grading Scale'!B$3,'Grading Scale'!C$3,IF(S242='Grading Scale'!B$5,'Grading Scale'!C$5,IF(S242='Grading Scale'!B$7,'Grading Scale'!C$7,IF(S242='Grading Scale'!B$9,'Grading Scale'!C$9,IF(S242='Grading Scale'!B$11,'Grading Scale'!C$11,'Grading Scale'!C$13))))),IF(S242='Grading Scale'!E$3,'Grading Scale'!F$3,IF(S242='Grading Scale'!E$5,'Grading Scale'!F$5,IF(S242='Grading Scale'!E$7,'Grading Scale'!F$7,IF(S242='Grading Scale'!E$9,'Grading Scale'!F$9,IF(S242='Grading Scale'!E$11,'Grading Scale'!F$11,'Grading Scale'!F$13))))))","v":"B    "}," ",null,""]
[{"$f":"Scores!A234","v":0},{"$f":"Scores!B234","v":0},{"$f":"Scores!C234","v":0},{"$f":"Scores!D234","v":0},{"$f":"Scores!E234","v":0},{"$f":"Scores!F234","v":0},{"$f":"Scores!G234","v":0},{"$f":"Scores!H234","v":0},{"$f":"Scores!I234","v":0},{"$f":"Scores!J234","v":0},{"$f":"Scores!K234","v":0},{"$f":"Scores!L234","v":0},{"$f":"Scores!M234","v":0},{"$f":"Scores!N234","v":0},{"$f":"Scores!O234","v":0},-0.70710678118654746,2.9512994231491119,2.9512994231491119,{"$f":"IF(R243<'Grading Scale'!G$8,IF(R243<'Grading Scale'!G$13,'Grading Scale'!E$13,IF(R243<'Grading Scale'!G$12,'Grading Scale'!E$11,IF(R243<'Grading Scale'!G$11,'Grading Scale'!E$9,IF(R243<'Grading Scale'!G$10,'Grading Scale'!E$7,IF(R243<'Grading Scale'!G$9,'Grading Scale'!E$5,'Grading Scale'!E$3))))),IF(R243<'Grading Scale'!G$7,'Grading Scale'!B$13,IF(R243<'Grading Scale'!G$6,'Grading Scale'!B$11,IF(R243<'Grading Scale'!G$5,'Grading Scale'!B$9,IF(R243<'Grading Scale'!G$4,'Grading Scale'!B$7,IF(R243<'Grading Scale'!G$3,'Grading Scale'!B$5,'Grading Scale'!B$3))))))","v":3},{"$f":"Scores!B234","v":0},{"$f":"IF(S243>='Grading Scale'!B$13,IF(S243='Grading Scale'!B$3,'Grading Scale'!C$3,IF(S243='Grading Scale'!B$5,'Grading Scale'!C$5,IF(S243='Grading Scale'!B$7,'Grading Scale'!C$7,IF(S243='Grading Scale'!B$9,'Grading Scale'!C$9,IF(S243='Grading Scale'!B$11,'Grading Scale'!C$11,'Grading Scale'!C$13))))),IF(S243='Grading Scale'!E$3,'Grading Scale'!F$3,IF(S243='Grading Scale'!E$5,'Grading Scale'!F$5,IF(S243='Grading Scale'!E$7,'Grading Scale'!F$7,IF(S243='Grading Scale'!E$9,'Grading Scale'!F$9,IF(S243='Grading Scale'!E$11,'Grading Scale'!F$11,'Grading Scale'!F$13))))))","v":"B    "}," ",null,""]
[{"$f":"Scores!A235","v":0},{"$f":"Scores!B235","v":0},{"$f":"Scores!C235","v":0},{"$f":"Scores!D235","v":0},{"$f":"Scores!E235","v":0},{"$f":"Scores!F235","v":0},{"$f":"Scores!G235","v":0},{"$f":"Scores!H235","v":0},{"$f":"Scores!I235","v":0},{"$f":"Scores!J235","v":0},{"$f":"Scores!K235","v":0},{"$f":"Scores!L235","v":0},{"$f":"Scores!M235","v":0},{"$f":"Scores!N235","v":0},{"$f":"Scores!O235","v":0},-0.70710678118654746,2.9512994231491119,2.9512994231491119,{"$f":"IF(R244<'Grading Scale'!G$8,IF(R244<'Grading Scale'!G$13,'Grading Scale'!E$13,IF(R244<'Grading Scale'!G$12,'Grading Scale'!E$11,IF(R244<'Grading Scale'!G$11,'Grading Scale'!E$9,IF(R244<'Grading Scale'!G$10,'Grading Scale'!E$7,IF(R244<'Grading Scale'!G$9,'Grading Scale'!E$5,'Grading Scale'!E$3))))),IF(R244<'Grading Scale'!G$7,'Grading Scale'!B$13,IF(R244<'Grading Scale'!G$6,'Grading Scale'!B$11,IF(R244<'Grading Scale'!G$5,'Grading Scale'!B$9,IF(R244<'Grading Scale'!G$4,'Grading Scale'!B$7,IF(R244<'Grading Scale'!G$3,'Grading Scale'!B$5,'Grading Scale'!B$3))))))","v":3},{"$f":"Scores!B235","v":0},{"$f":"IF(S244>='Grading Scale'!B$13,IF(S244='Grading Scale'!B$3,'Grading Scale'!C$3,IF(S244='Grading Scale'!B$5,'Grading Scale'!C$5,IF(S244='Grading Scale'!B$7,'Grading Scale'!C$7,IF(S244='Grading Scale'!B$9,'Grading Scale'!C$9,IF(S244='Grading Scale'!B$11,'Grading Scale'!C$11,'Grading Scale'!C$13))))),IF(S244='Grading Scale'!E$3,'Grading Scale'!F$3,IF(S244='Grading Scale'!E$5,'Grading Scale'!F$5,IF(S244='Grading Scale'!E$7,'Grading Scale'!F$7,IF(S244='Grading Scale'!E$9,'Grading Scale'!F$9,IF(S244='Grading Scale'!E$11,'Grading Scale'!F$11,'Grading Scale'!F$13))))))","v":"B    "}," ",null,""]
[{"$f":"Scores!A236","v":0},{"$f":"Scores!B236","v":0},{"$f":"Scores!C236","v":0},{"$f":"Scores!D236","v":0},{"$f":"Scores!E236","v":0},{"$f":"Scores!F236","v":0},{"$f":"Scores!G236","v":0},{"$f":"Scores!H236","v":0},{"$f":"Scores!I236","v":0},{"$f":"Scores!J236","v":0},{"$f":"Scores!K236","v":0},{"$f":"Scores!L236","v":0},{"$f":"Scores!M236","v":0},{"$f":"Scores!N236","v":0},{"$f":"Scores!O236","v":0},-0.70710678118654746,2.9512994231491119,2.9512994231491119,{"$f":"IF(R245<'Grading Scale'!G$8,IF(R245<'Grading Scale'!G$13,'Grading Scale'!E$13,IF(R245<'Grading Scale'!G$12,'Grading Scale'!E$11,IF(R245<'Grading Scale'!G$11,'Grading Scale'!E$9,IF(R245<'Grading Scale'!G$10,'Grading Scale'!E$7,IF(R245<'Grading Scale'!G$9,'Grading Scale'!E$5,'Grading Scale'!E$3))))),IF(R245<'Grading Scale'!G$7,'Grading Scale'!B$13,IF(R245<'Grading Scale'!G$6,'Grading Scale'!B$11,IF(R245<'Grading Scale'!G$5,'Grading Scale'!B$9,IF(R245<'Grading Scale'!G$4,'Grading Scale'!B$7,IF(R245<'Grading Scale'!G$3,'Grading Scale'!B$5,'Grading Scale'!B$3))))))","v":3},{"$f":"Scores!B236","v":0},{"$f":"IF(S245>='Grading Scale'!B$13,IF(S245='Grading Scale'!B$3,'Grading Scale'!C$3,IF(S245='Grading Scale'!B$5,'Grading Scale'!C$5,IF(S245='Grading Scale'!B$7,'Grading Scale'!C$7,IF(S245='Grading Scale'!B$9,'Grading Scale'!C$9,IF(S245='Grading Scale'!B$11,'Grading Scale'!C$11,'Grading Scale'!C$13))))),IF(S245='Grading Scale'!E$3,'Grading Scale'!F$3,IF(S245='Grading Scale'!E$5,'Grading Scale'!F$5,IF(S245='Grading Scale'!E$7,'Grading Scale'!F$7,IF(S245='Grading Scale'!E$9,'Grading Scale'!F$9,IF(S245='Grading Scale'!E$11,'Grading Scale'!F$11,'Grading Scale'!F$13))))))","v":"B    "}," ",null,""]
[{"$f":"Scores!A237","v":0},{"$f":"Scores!B237","v":0},{"$f":"Scores!C237","v":0},{"$f":"Scores!D237","v":0},{"$f":"Scores!E237","v":0},{"$f":"Scores!F237","v":0},{"$f":"Scores!G237","v":0},{"$f":"Scores!H237","v":0},{"$f":"Scores!I237","v":0},{"$f":"Scores!J237","v":0},{"$f":"Scores!K237","v":0},{"$f":"Scores!L237","v":0},{"$f":"Scores!M237","v":0},{"$f":"Scores!N237","v":0},{"$f":"Scores!O237","v":0},-0.70710678118654746,2.9512994231491119,2.9512994231491119,{"$f":"IF(R246<'Grading Scale'!G$8,IF(R246<'Grading Scale'!G$13,'Grading Scale'!E$13,IF(R246<'Grading Scale'!G$12,'Grading Scale'!E$11,IF(R246<'Grading Scale'!G$11,'Grading Scale'!E$9,IF(R246<'Grading Scale'!G$10,'Grading Scale'!E$7,IF(R246<'Grading Scale'!G$9,'Grading Scale'!E$5,'Grading Scale'!E$3))))),IF(R246<'Grading Scale'!G$7,'Grading Scale'!B$13,IF(R246<'Grading Scale'!G$6,'Grading Scale'!B$11,IF(R246<'Grading Scale'!G$5,'Grading Scale'!B$9,IF(R246<'Grading Scale'!G$4,'Grading Scale'!B$7,IF(R246<'Grading Scale'!G$3,'Grading Scale'!B$5,'Grading Scale'!B$3))))))","v":3},{"$f":"Scores!B237","v":0},{"$f":"IF(S246>='Grading Scale'!B$13,IF(S246='Grading Scale'!B$3,'Grading Scale'!C$3,IF(S246='Grading Scale'!B$5,'Grading Scale'!C$5,IF(S246='Grading Scale'!B$7,'Grading Scale'!C$7,IF(S246='Grading Scale'!B$9,'Grading Scale'!C$9,IF(S246='Grading Scale'!B$11,'Grading Scale'!C$11,'Grading Scale'!C$13))))),IF(S246='Grading Scale'!E$3,'Grading Scale'!F$3,IF(S246='Grading Scale'!E$5,'Grading Scale'!F$5,IF(S246='Grading Scale'!E$7,'Grading Scale'!F$7,IF(S246='Grading Scale'!E$9,'Grading Scale'!F$9,IF(S246='Grading Scale'!E$11,'Grading Scale'!F$11,'Grading Scale'!F$13))))))","v":"B    "}," ",null,""]
[{"$f":"Scores!A238","v":0},{"$f":"Scores!B238","v":0},{"$f":"Scores!C238","v":0},{"$f":"Scores!D238","v":0},{"$f":"Scores!E238","v":0},{"$f":"Scores!F238","v":0},{"$f":"Scores!G238","v":0},{"$f":"Scores!H238","v":0},{"$f":"Scores!I238","v":0},{"$f":"Scores!J238","v":0},{"$f":"Scores!K238","v":0},{"$f":"Scores!L238","v":0},{"$f":"Scores!M238","v":0},{"$f":"Scores!N238","v":0},{"$f":"Scores!O238","v":0},-0.70710678118654746,2.9512994231491119,2.9512994231491119,{"$f":"IF(R247<'Grading Scale'!G$8,IF(R247<'Grading Scale'!G$13,'Grading Scale'!E$13,IF(R247<'Grading Scale'!G$12,'Grading Scale'!E$11,IF(R247<'Grading Scale'!G$11,'Grading Scale'!E$9,IF(R247<'Grading Scale'!G$10,'Grading Scale'!E$7,IF(R247<'Grading Scale'!G$9,'Grading Scale'!E$5,'Grading Scale'!E$3))))),IF(R247<'Grading Scale'!G$7,'Grading Scale'!B$13,IF(R247<'Grading Scale'!G$6,'Grading Scale'!B$11,IF(R247<'Grading Scale'!G$5,'Grading Scale'!B$9,IF(R247<'Grading Scale'!G$4,'Grading Scale'!B$7,IF(R247<'Grading Scale'!G$3,'Grading Scale'!B$5,'Grading Scale'!B$3))))))","v":3},{"$f":"Scores!B238","v":0},{"$f":"IF(S247>='Grading Scale'!B$13,IF(S247='Grading Scale'!B$3,'Grading Scale'!C$3,IF(S247='Grading Scale'!B$5,'Grading Scale'!C$5,IF(S247='Grading Scale'!B$7,'Grading Scale'!C$7,IF(S247='Grading Scale'!B$9,'Grading Scale'!C$9,IF(S247='Grading Scale'!B$11,'Grading Scale'!C$11,'Grading Scale'!C$13))))),IF(S247='Grading Scale'!E$3,'Grading Scale'!F$3,IF(S247='Grading Scale'!E$5,'Grading Scale'!F$5,IF(S247='Grading Scale'!E$7,'Grading Scale'!F$7,IF(S247='Grading Scale'!E$9,'Grading Scale'!F$9,IF(S247='Grading Scale'!E$11,'Grading Scale'!F$11,'Grading Scale'!F$13))))))","v":"B    "}," ",null,""]
[{"$f":"Scores!A239","v":0},{"$f":"Scores!B239","v":0},{"$f":"Scores!C239","v":0},{"$f":"Scores!D239","v":0},{"$f":"Scores!E239","v":0},{"$f":"Scores!F239","v":0},{"$f":"Scores!G239","v":0},{"$f":"Scores!H239","v":0},{"$f":"Scores!I239","v":0},{"$f":"Scores!J239","v":0},{"$f":"Scores!K239","v":0},{"$f":"Scores!L239","v":0},{"$f":"Scores!M239","v":0},{"$f":"Scores!N239","v":0},{"$f":"Scores!O239","v":0},-0.70710678118654746,2.9512994231491119,2.9512994231491119,{"$f":"IF(R248<'Grading Scale'!G$8,IF(R248<'Grading Scale'!G$13,'Grading Scale'!E$13,IF(R248<'Grading Scale'!G$12,'Grading Scale'!E$11,IF(R248<'Grading Scale'!G$11,'Grading Scale'!E$9,IF(R248<'Grading Scale'!G$10,'Grading Scale'!E$7,IF(R248<'Grading Scale'!G$9,'Grading Scale'!E$5,'Grading Scale'!E$3))))),IF(R248<'Grading Scale'!G$7,'Grading Scale'!B$13,IF(R248<'Grading Scale'!G$6,'Grading Scale'!B$11,IF(R248<'Grading Scale'!G$5,'Grading Scale'!B$9,IF(R248<'Grading Scale'!G$4,'Grading Scale'!B$7,IF(R248<'Grading Scale'!G$3,'Grading Scale'!B$5,'Grading Scale'!B$3))))))","v":3},{"$f":"Scores!B239","v":0},{"$f":"IF(S248>='Grading Scale'!B$13,IF(S248='Grading Scale'!B$3,'Grading Scale'!C$3,IF(S248='Grading Scale'!B$5,'Grading Scale'!C$5,IF(S248='Grading Scale'!B$7,'Grading Scale'!C$7,IF(S248='Grading Scale'!B$9,'Grading Scale'!C$9,IF(S248='Grading Scale'!B$11,'Grading Scale'!C$11,'Grading Scale'!C$13))))),IF(S248='Grading Scale'!E$3,'Grading Scale'!F$3,IF(S248='Grading Scale'!E$5,'Grading Scale'!F$5,IF(S248='Grading Scale'!E$7,'Grading Scale'!F$7,IF(S248='Grading Scale'!E$9,'Grading Scale'!F$9,IF(S248='Grading Scale'!E$11,'Grading Scale'!F$11,'Grading Scale'!F$13))))))","v":"B    "}," ",null,""]
[{"$f":"Scores!A240","v":0},{"$f":"Scores!B240","v":0},{"$f":"Scores!C240","v":0},{"$f":"Scores!D240","v":0},{"$f":"Scores!E240","v":0},{"$f":"Scores!F240","v":0},{"$f":"Scores!G240","v":0},{"$f":"Scores!H240","v":0},{"$f":"Scores!I240","v":0},{"$f":"Scores!J240","v":0},{"$f":"Scores!K240","v":0},{"$f":"Scores!L240","v":0},{"$f":"Scores!M240","v":0},{"$f":"Scores!N240","v":0},{"$f":"Scores!O240","v":0},-0.70710678118654746,2.9512994231491119,2.9512994231491119,{"$f":"IF(R249<'Grading Scale'!G$8,IF(R249<'Grading Scale'!G$13,'Grading Scale'!E$13,IF(R249<'Grading Scale'!G$12,'Grading Scale'!E$11,IF(R249<'Grading Scale'!G$11,'Grading Scale'!E$9,IF(R249<'Grading Scale'!G$10,'Grading Scale'!E$7,IF(R249<'Grading Scale'!G$9,'Grading Scale'!E$5,'Grading Scale'!E$3))))),IF(R249<'Grading Scale'!G$7,'Grading Scale'!B$13,IF(R249<'Grading Scale'!G$6,'Grading Scale'!B$11,IF(R249<'Grading Scale'!G$5,'Grading Scale'!B$9,IF(R249<'Grading Scale'!G$4,'Grading Scale'!B$7,IF(R249<'Grading Scale'!G$3,'Grading Scale'!B$5,'Grading Scale'!B$3))))))","v":3},{"$f":"Scores!B240","v":0},{"$f":"IF(S249>='Grading Scale'!B$13,IF(S249='Grading Scale'!B$3,'Grading Scale'!C$3,IF(S249='Grading Scale'!B$5,'Grading Scale'!C$5,IF(S249='Grading Scale'!B$7,'Grading Scale'!C$7,IF(S249='Grading Scale'!B$9,'Grading Scale'!C$9,IF(S249='Grading Scale'!B$11,'Grading Scale'!C$11,'Grading Scale'!C$13))))),IF(S249='Grading Scale'!E$3,'Grading Scale'!F$3,IF(S249='Grading Scale'!E$5,'Grading Scale'!F$5,IF(S249='Grading Scale'!E$7,'Grading Scale'!F$7,IF(S249='Grading Scale'!E$9,'Grading Scale'!F$9,IF(S249='Grading Scale'!E$11,'Grading Scale'!F$11,'Grading Scale'!F$13))))))","v":"B    "}," ",null,""]
[{"$f":"Scores!A241","v":0},{"$f":"Scores!B241","v":0},{"$f":"Scores!C241","v":0},{"$f":"Scores!D241","v":0},{"$f":"Scores!E241","v":0},{"$f":"Scores!F241","v":0},{"$f":"Scores!G241","v":0},{"$f":"Scores!H241","v":0},{"$f":"Scores!I241","v":0},{"$f":"Scores!J241","v":0},{"$f":"Scores!K241","v":0},{"$f":"Scores!L241","v":0},{"$f":"Scores!M241","v":0},{"$f":"Scores!N241","v":0},{"$f":"Scores!O241","v":0},-0.70710678118654746,2.9512994231491119,2.9512994231491119,{"$f":"IF(R250<'Grading Scale'!G$8,IF(R250<'Grading Scale'!G$13,'Grading Scale'!E$13,IF(R250<'Grading Scale'!G$12,'Grading Scale'!E$11,IF(R250<'Grading Scale'!G$11,'Grading Scale'!E$9,IF(R250<'Grading Scale'!G$10,'Grading Scale'!E$7,IF(R250<'Grading Scale'!G$9,'Grading Scale'!E$5,'Grading Scale'!E$3))))),IF(R250<'Grading Scale'!G$7,'Grading Scale'!B$13,IF(R250<'Grading Scale'!G$6,'Grading Scale'!B$11,IF(R250<'Grading Scale'!G$5,'Grading Scale'!B$9,IF(R250<'Grading Scale'!G$4,'Grading Scale'!B$7,IF(R250<'Grading Scale'!G$3,'Grading Scale'!B$5,'Grading Scale'!B$3))))))","v":3},{"$f":"Scores!B241","v":0},{"$f":"IF(S250>='Grading Scale'!B$13,IF(S250='Grading Scale'!B$3,'Grading Scale'!C$3,IF(S250='Grading Scale'!B$5,'Grading Scale'!C$5,IF(S250='Grading Scale'!B$7,'Grading Scale'!C$7,IF(S250='Grading Scale'!B$9,'Grading Scale'!C$9,IF(S250='Grading Scale'!B$11,'Grading Scale'!C$11,'Grading Scale'!C$13))))),IF(S250='Grading Scale'!E$3,'Grading Scale'!F$3,IF(S250='Grading Scale'!E$5,'Grading Scale'!F$5,IF(S250='Grading Scale'!E$7,'Grading Scale'!F$7,IF(S250='Grading Scale'!E$9,'Grading Scale'!F$9,IF(S250='Grading Scale'!E$11,'Grading Scale'!F$11,'Grading Scale'!F$13))))))","v":"B    "}," ",null,""]
[{"$f":"Scores!A242","v":0},{"$f":"Scores!B242","v":0},{"$f":"Scores!C242","v":0},{"$f":"Scores!D242","v":0},{"$f":"Scores!E242","v":0},{"$f":"Scores!F242","v":0},{"$f":"Scores!G242","v":0},{"$f":"Scores!H242","v":0},{"$f":"Scores!I242","v":0},{"$f":"Scores!J242","v":0},{"$f":"Scores!K242","v":0},{"$f":"Scores!L242","v":0},{"$f":"Scores!M242","v":0},{"$f":"Scores!N242","v":0},{"$f":"Scores!O242","v":0},-0.70710678118654746,2.9512994231491119,2.9512994231491119,{"$f":"IF(R251<'Grading Scale'!G$8,IF(R251<'Grading Scale'!G$13,'Grading Scale'!E$13,IF(R251<'Grading Scale'!G$12,'Grading Scale'!E$11,IF(R251<'Grading Scale'!G$11,'Grading Scale'!E$9,IF(R251<'Grading Scale'!G$10,'Grading Scale'!E$7,IF(R251<'Grading Scale'!G$9,'Grading Scale'!E$5,'Grading Scale'!E$3))))),IF(R251<'Grading Scale'!G$7,'Grading Scale'!B$13,IF(R251<'Grading Scale'!G$6,'Grading Scale'!B$11,IF(R251<'Grading Scale'!G$5,'Grading Scale'!B$9,IF(R251<'Grading Scale'!G$4,'Grading Scale'!B$7,IF(R251<'Grading Scale'!G$3,'Grading Scale'!B$5,'Grading Scale'!B$3))))))","v":3},{"$f":"Scores!B242","v":0},{"$f":"IF(S251>='Grading Scale'!B$13,IF(S251='Grading Scale'!B$3,'Grading Scale'!C$3,IF(S251='Grading Scale'!B$5,'Grading Scale'!C$5,IF(S251='Grading Scale'!B$7,'Grading Scale'!C$7,IF(S251='Grading Scale'!B$9,'Grading Scale'!C$9,IF(S251='Grading Scale'!B$11,'Grading Scale'!C$11,'Grading Scale'!C$13))))),IF(S251='Grading Scale'!E$3,'Grading Scale'!F$3,IF(S251='Grading Scale'!E$5,'Grading Scale'!F$5,IF(S251='Grading Scale'!E$7,'Grading Scale'!F$7,IF(S251='Grading Scale'!E$9,'Grading Scale'!F$9,IF(S251='Grading Scale'!E$11,'Grading Scale'!F$11,'Grading Scale'!F$13))))))","v":"B    "}," ",null,""]
[{"$f":"Scores!A243","v":0},{"$f":"Scores!B243","v":0},{"$f":"Scores!C243","v":0},{"$f":"Scores!D243","v":0},{"$f":"Scores!E243","v":0},{"$f":"Scores!F243","v":0},{"$f":"Scores!G243","v":0},{"$f":"Scores!H243","v":0},{"$f":"Scores!I243","v":0},{"$f":"Scores!J243","v":0},{"$f":"Scores!K243","v":0},{"$f":"Scores!L243","v":0},{"$f":"Scores!M243","v":0},{"$f":"Scores!N243","v":0},{"$f":"Scores!O243","v":0},-0.70710678118654746,2.9512994231491119,2.9512994231491119,{"$f":"IF(R252<'Grading Scale'!G$8,IF(R252<'Grading Scale'!G$13,'Grading Scale'!E$13,IF(R252<'Grading Scale'!G$12,'Grading Scale'!E$11,IF(R252<'Grading Scale'!G$11,'Grading Scale'!E$9,IF(R252<'Grading Scale'!G$10,'Grading Scale'!E$7,IF(R252<'Grading Scale'!G$9,'Grading Scale'!E$5,'Grading Scale'!E$3))))),IF(R252<'Grading Scale'!G$7,'Grading Scale'!B$13,IF(R252<'Grading Scale'!G$6,'Grading Scale'!B$11,IF(R252<'Grading Scale'!G$5,'Grading Scale'!B$9,IF(R252<'Grading Scale'!G$4,'Grading Scale'!B$7,IF(R252<'Grading Scale'!G$3,'Grading Scale'!B$5,'Grading Scale'!B$3))))))","v":3},{"$f":"Scores!B243","v":0},{"$f":"IF(S252>='Grading Scale'!B$13,IF(S252='Grading Scale'!B$3,'Grading Scale'!C$3,IF(S252='Grading Scale'!B$5,'Grading Scale'!C$5,IF(S252='Grading Scale'!B$7,'Grading Scale'!C$7,IF(S252='Grading Scale'!B$9,'Grading Scale'!C$9,IF(S252='Grading Scale'!B$11,'Grading Scale'!C$11,'Grading Scale'!C$13))))),IF(S252='Grading Scale'!E$3,'Grading Scale'!F$3,IF(S252='Grading Scale'!E$5,'Grading Scale'!F$5,IF(S252='Grading Scale'!E$7,'Grading Scale'!F$7,IF(S252='Grading Scale'!E$9,'Grading Scale'!F$9,IF(S252='Grading Scale'!E$11,'Grading Scale'!F$11,'Grading Scale'!F$13))))))","v":"B    "}," ",null,""]
[{"$f":"Scores!A244","v":0},{"$f":"Scores!B244","v":0},{"$f":"Scores!C244","v":0},{"$f":"Scores!D244","v":0},{"$f":"Scores!E244","v":0},{"$f":"Scores!F244","v":0},{"$f":"Scores!G244","v":0},{"$f":"Scores!H244","v":0},{"$f":"Scores!I244","v":0},{"$f":"Scores!J244","v":0},{"$f":"Scores!K244","v":0},{"$f":"Scores!L244","v":0},{"$f":"Scores!M244","v":0},{"$f":"Scores!N244","v":0},{"$f":"Scores!O244","v":0},-0.70710678118654746,2.9512994231491119,2.9512994231491119,{"$f":"IF(R253<'Grading Scale'!G$8,IF(R253<'Grading Scale'!G$13,'Grading Scale'!E$13,IF(R253<'Grading Scale'!G$12,'Grading Scale'!E$11,IF(R253<'Grading Scale'!G$11,'Grading Scale'!E$9,IF(R253<'Grading Scale'!G$10,'Grading Scale'!E$7,IF(R253<'Grading Scale'!G$9,'Grading Scale'!E$5,'Grading Scale'!E$3))))),IF(R253<'Grading Scale'!G$7,'Grading Scale'!B$13,IF(R253<'Grading Scale'!G$6,'Grading Scale'!B$11,IF(R253<'Grading Scale'!G$5,'Grading Scale'!B$9,IF(R253<'Grading Scale'!G$4,'Grading Scale'!B$7,IF(R253<'Grading Scale'!G$3,'Grading Scale'!B$5,'Grading Scale'!B$3))))))","v":3},{"$f":"Scores!B244","v":0},{"$f":"IF(S253>='Grading Scale'!B$13,IF(S253='Grading Scale'!B$3,'Grading Scale'!C$3,IF(S253='Grading Scale'!B$5,'Grading Scale'!C$5,IF(S253='Grading Scale'!B$7,'Grading Scale'!C$7,IF(S253='Grading Scale'!B$9,'Grading Scale'!C$9,IF(S253='Grading Scale'!B$11,'Grading Scale'!C$11,'Grading Scale'!C$13))))),IF(S253='Grading Scale'!E$3,'Grading Scale'!F$3,IF(S253='Grading Scale'!E$5,'Grading Scale'!F$5,IF(S253='Grading Scale'!E$7,'Grading Scale'!F$7,IF(S253='Grading Scale'!E$9,'Grading Scale'!F$9,IF(S253='Grading Scale'!E$11,'Grading Scale'!F$11,'Grading Scale'!F$13))))))","v":"B    "}," ",null,""]
[{"$f":"Scores!A245","v":0},{"$f":"Scores!B245","v":0},{"$f":"Scores!C245","v":0},{"$f":"Scores!D245","v":0},{"$f":"Scores!E245","v":0},{"$f":"Scores!F245","v":0},{"$f":"Scores!G245","v":0},{"$f":"Scores!H245","v":0},{"$f":"Scores!I245","v":0},{"$f":"Scores!J245","v":0},{"$f":"Scores!K245","v":0},{"$f":"Scores!L245","v":0},{"$f":"Scores!M245","v":0},{"$f":"Scores!N245","v":0},{"$f":"Scores!O245","v":0},-0.70710678118654746,2.9512994231491119,2.9512994231491119,{"$f":"IF(R254<'Grading Scale'!G$8,IF(R254<'Grading Scale'!G$13,'Grading Scale'!E$13,IF(R254<'Grading Scale'!G$12,'Grading Scale'!E$11,IF(R254<'Grading Scale'!G$11,'Grading Scale'!E$9,IF(R254<'Grading Scale'!G$10,'Grading Scale'!E$7,IF(R254<'Grading Scale'!G$9,'Grading Scale'!E$5,'Grading Scale'!E$3))))),IF(R254<'Grading Scale'!G$7,'Grading Scale'!B$13,IF(R254<'Grading Scale'!G$6,'Grading Scale'!B$11,IF(R254<'Grading Scale'!G$5,'Grading Scale'!B$9,IF(R254<'Grading Scale'!G$4,'Grading Scale'!B$7,IF(R254<'Grading Scale'!G$3,'Grading Scale'!B$5,'Grading Scale'!B$3))))))","v":3},{"$f":"Scores!B245","v":0},{"$f":"IF(S254>='Grading Scale'!B$13,IF(S254='Grading Scale'!B$3,'Grading Scale'!C$3,IF(S254='Grading Scale'!B$5,'Grading Scale'!C$5,IF(S254='Grading Scale'!B$7,'Grading Scale'!C$7,IF(S254='Grading Scale'!B$9,'Grading Scale'!C$9,IF(S254='Grading Scale'!B$11,'Grading Scale'!C$11,'Grading Scale'!C$13))))),IF(S254='Grading Scale'!E$3,'Grading Scale'!F$3,IF(S254='Grading Scale'!E$5,'Grading Scale'!F$5,IF(S254='Grading Scale'!E$7,'Grading Scale'!F$7,IF(S254='Grading Scale'!E$9,'Grading Scale'!F$9,IF(S254='Grading Scale'!E$11,'Grading Scale'!F$11,'Grading Scale'!F$13))))))","v":"B    "}," ",null,""]
[{"$f":"Scores!A246","v":0},{"$f":"Scores!B246","v":0},{"$f":"Scores!C246","v":0},{"$f":"Scores!D246","v":0},{"$f":"Scores!E246","v":0},{"$f":"Scores!F246","v":0},{"$f":"Scores!G246","v":0},{"$f":"Scores!H246","v":0},{"$f":"Scores!I246","v":0},{"$f":"Scores!J246","v":0},{"$f":"Scores!K246","v":0},{"$f":"Scores!L246","v":0},{"$f":"Scores!M246","v":0},{"$f":"Scores!N246","v":0},{"$f":"Scores!O246","v":0},-0.70710678118654746,2.9512994231491119,2.9512994231491119,{"$f":"IF(R255<'Grading Scale'!G$8,IF(R255<'Grading Scale'!G$13,'Grading Scale'!E$13,IF(R255<'Grading Scale'!G$12,'Grading Scale'!E$11,IF(R255<'Grading Scale'!G$11,'Grading Scale'!E$9,IF(R255<'Grading Scale'!G$10,'Grading Scale'!E$7,IF(R255<'Grading Scale'!G$9,'Grading Scale'!E$5,'Grading Scale'!E$3))))),IF(R255<'Grading Scale'!G$7,'Grading Scale'!B$13,IF(R255<'Grading Scale'!G$6,'Grading Scale'!B$11,IF(R255<'Grading Scale'!G$5,'Grading Scale'!B$9,IF(R255<'Grading Scale'!G$4,'Grading Scale'!B$7,IF(R255<'Grading Scale'!G$3,'Grading Scale'!B$5,'Grading Scale'!B$3))))))","v":3},{"$f":"Scores!B246","v":0},{"$f":"IF(S255>='Grading Scale'!B$13,IF(S255='Grading Scale'!B$3,'Grading Scale'!C$3,IF(S255='Grading Scale'!B$5,'Grading Scale'!C$5,IF(S255='Grading Scale'!B$7,'Grading Scale'!C$7,IF(S255='Grading Scale'!B$9,'Grading Scale'!C$9,IF(S255='Grading Scale'!B$11,'Grading Scale'!C$11,'Grading Scale'!C$13))))),IF(S255='Grading Scale'!E$3,'Grading Scale'!F$3,IF(S255='Grading Scale'!E$5,'Grading Scale'!F$5,IF(S255='Grading Scale'!E$7,'Grading Scale'!F$7,IF(S255='Grading Scale'!E$9,'Grading Scale'!F$9,IF(S255='Grading Scale'!E$11,'Grading Scale'!F$11,'Grading Scale'!F$13))))))","v":"B    "}," ",null,""]
[{"$f":"Scores!A247","v":0},{"$f":"Scores!B247","v":0},{"$f":"Scores!C247","v":0},{"$f":"Scores!D247","v":0},{"$f":"Scores!E247","v":0},{"$f":"Scores!F247","v":0},{"$f":"Scores!G247","v":0},{"$f":"Scores!H247","v":0},{"$f":"Scores!I247","v":0},{"$f":"Scores!J247","v":0},{"$f":"Scores!K247","v":0},{"$f":"Scores!L247","v":0},{"$f":"Scores!M247","v":0},{"$f":"Scores!N247","v":0},{"$f":"Scores!O247","v":0},-0.70710678118654746,2.9512994231491119,2.9512994231491119,{"$f":"IF(R256<'Grading Scale'!G$8,IF(R256<'Grading Scale'!G$13,'Grading Scale'!E$13,IF(R256<'Grading Scale'!G$12,'Grading Scale'!E$11,IF(R256<'Grading Scale'!G$11,'Grading Scale'!E$9,IF(R256<'Grading Scale'!G$10,'Grading Scale'!E$7,IF(R256<'Grading Scale'!G$9,'Grading Scale'!E$5,'Grading Scale'!E$3))))),IF(R256<'Grading Scale'!G$7,'Grading Scale'!B$13,IF(R256<'Grading Scale'!G$6,'Grading Scale'!B$11,IF(R256<'Grading Scale'!G$5,'Grading Scale'!B$9,IF(R256<'Grading Scale'!G$4,'Grading Scale'!B$7,IF(R256<'Grading Scale'!G$3,'Grading Scale'!B$5,'Grading Scale'!B$3))))))","v":3},{"$f":"Scores!B247","v":0},{"$f":"IF(S256>='Grading Scale'!B$13,IF(S256='Grading Scale'!B$3,'Grading Scale'!C$3,IF(S256='Grading Scale'!B$5,'Grading Scale'!C$5,IF(S256='Grading Scale'!B$7,'Grading Scale'!C$7,IF(S256='Grading Scale'!B$9,'Grading Scale'!C$9,IF(S256='Grading Scale'!B$11,'Grading Scale'!C$11,'Grading Scale'!C$13))))),IF(S256='Grading Scale'!E$3,'Grading Scale'!F$3,IF(S256='Grading Scale'!E$5,'Grading Scale'!F$5,IF(S256='Grading Scale'!E$7,'Grading Scale'!F$7,IF(S256='Grading Scale'!E$9,'Grading Scale'!F$9,IF(S256='Grading Scale'!E$11,'Grading Scale'!F$11,'Grading Scale'!F$13))))))","v":"B    "}," ",null,""]
[{"$f":"Scores!A248","v":0},{"$f":"Scores!B248","v":0},{"$f":"Scores!C248","v":0},{"$f":"Scores!D248","v":0},{"$f":"Scores!E248","v":0},{"$f":"Scores!F248","v":0},{"$f":"Scores!G248","v":0},{"$f":"Scores!H248","v":0},{"$f":"Scores!I248","v":0},{"$f":"Scores!J248","v":0},{"$f":"Scores!K248","v":0},{"$f":"Scores!L248","v":0},{"$f":"Scores!M248","v":0},{"$f":"Scores!N248","v":0},{"$f":"Scores!O248","v":0},-0.70710678118654746,2.9512994231491119,2.9512994231491119,{"$f":"IF(R257<'Grading Scale'!G$8,IF(R257<'Grading Scale'!G$13,'Grading Scale'!E$13,IF(R257<'Grading Scale'!G$12,'Grading Scale'!E$11,IF(R257<'Grading Scale'!G$11,'Grading Scale'!E$9,IF(R257<'Grading Scale'!G$10,'Grading Scale'!E$7,IF(R257<'Grading Scale'!G$9,'Grading Scale'!E$5,'Grading Scale'!E$3))))),IF(R257<'Grading Scale'!G$7,'Grading Scale'!B$13,IF(R257<'Grading Scale'!G$6,'Grading Scale'!B$11,IF(R257<'Grading Scale'!G$5,'Grading Scale'!B$9,IF(R257<'Grading Scale'!G$4,'Grading Scale'!B$7,IF(R257<'Grading Scale'!G$3,'Grading Scale'!B$5,'Grading Scale'!B$3))))))","v":3},{"$f":"Scores!B248","v":0},{"$f":"IF(S257>='Grading Scale'!B$13,IF(S257='Grading Scale'!B$3,'Grading Scale'!C$3,IF(S257='Grading Scale'!B$5,'Grading Scale'!C$5,IF(S257='Grading Scale'!B$7,'Grading Scale'!C$7,IF(S257='Grading Scale'!B$9,'Grading Scale'!C$9,IF(S257='Grading Scale'!B$11,'Grading Scale'!C$11,'Grading Scale'!C$13))))),IF(S257='Grading Scale'!E$3,'Grading Scale'!F$3,IF(S257='Grading Scale'!E$5,'Grading Scale'!F$5,IF(S257='Grading Scale'!E$7,'Grading Scale'!F$7,IF(S257='Grading Scale'!E$9,'Grading Scale'!F$9,IF(S257='Grading Scale'!E$11,'Grading Scale'!F$11,'Grading Scale'!F$13))))))","v":"B    "}," ",null,""]
[{"$f":"Scores!A249","v":0},{"$f":"Scores!B249","v":0},{"$f":"Scores!C249","v":0},{"$f":"Scores!D249","v":0},{"$f":"Scores!E249","v":0},{"$f":"Scores!F249","v":0},{"$f":"Scores!G249","v":0},{"$f":"Scores!H249","v":0},{"$f":"Scores!I249","v":0},{"$f":"Scores!J249","v":0},{"$f":"Scores!K249","v":0},{"$f":"Scores!L249","v":0},{"$f":"Scores!M249","v":0},{"$f":"Scores!N249","v":0},{"$f":"Scores!O249","v":0},-0.70710678118654746,2.9512994231491119,2.9512994231491119,{"$f":"IF(R258<'Grading Scale'!G$8,IF(R258<'Grading Scale'!G$13,'Grading Scale'!E$13,IF(R258<'Grading Scale'!G$12,'Grading Scale'!E$11,IF(R258<'Grading Scale'!G$11,'Grading Scale'!E$9,IF(R258<'Grading Scale'!G$10,'Grading Scale'!E$7,IF(R258<'Grading Scale'!G$9,'Grading Scale'!E$5,'Grading Scale'!E$3))))),IF(R258<'Grading Scale'!G$7,'Grading Scale'!B$13,IF(R258<'Grading Scale'!G$6,'Grading Scale'!B$11,IF(R258<'Grading Scale'!G$5,'Grading Scale'!B$9,IF(R258<'Grading Scale'!G$4,'Grading Scale'!B$7,IF(R258<'Grading Scale'!G$3,'Grading Scale'!B$5,'Grading Scale'!B$3))))))","v":3},{"$f":"Scores!B249","v":0},{"$f":"IF(S258>='Grading Scale'!B$13,IF(S258='Grading Scale'!B$3,'Grading Scale'!C$3,IF(S258='Grading Scale'!B$5,'Grading Scale'!C$5,IF(S258='Grading Scale'!B$7,'Grading Scale'!C$7,IF(S258='Grading Scale'!B$9,'Grading Scale'!C$9,IF(S258='Grading Scale'!B$11,'Grading Scale'!C$11,'Grading Scale'!C$13))))),IF(S258='Grading Scale'!E$3,'Grading Scale'!F$3,IF(S258='Grading Scale'!E$5,'Grading Scale'!F$5,IF(S258='Grading Scale'!E$7,'Grading Scale'!F$7,IF(S258='Grading Scale'!E$9,'Grading Scale'!F$9,IF(S258='Grading Scale'!E$11,'Grading Scale'!F$11,'Grading Scale'!F$13))))))","v":"B    "}," ",null,""]
[{"$f":"Scores!A250","v":0},{"$f":"Scores!B250","v":0},{"$f":"Scores!C250","v":0},{"$f":"Scores!D250","v":0},{"$f":"Scores!E250","v":0},{"$f":"Scores!F250","v":0},{"$f":"Scores!G250","v":0},{"$f":"Scores!H250","v":0},{"$f":"Scores!I250","v":0},{"$f":"Scores!J250","v":0},{"$f":"Scores!K250","v":0},{"$f":"Scores!L250","v":0},{"$f":"Scores!M250","v":0},{"$f":"Scores!N250","v":0},{"$f":"Scores!O250","v":0},-0.70710678118654746,2.9512994231491119,2.9512994231491119,{"$f":"IF(R259<'Grading Scale'!G$8,IF(R259<'Grading Scale'!G$13,'Grading Scale'!E$13,IF(R259<'Grading Scale'!G$12,'Grading Scale'!E$11,IF(R259<'Grading Scale'!G$11,'Grading Scale'!E$9,IF(R259<'Grading Scale'!G$10,'Grading Scale'!E$7,IF(R259<'Grading Scale'!G$9,'Grading Scale'!E$5,'Grading Scale'!E$3))))),IF(R259<'Grading Scale'!G$7,'Grading Scale'!B$13,IF(R259<'Grading Scale'!G$6,'Grading Scale'!B$11,IF(R259<'Grading Scale'!G$5,'Grading Scale'!B$9,IF(R259<'Grading Scale'!G$4,'Grading Scale'!B$7,IF(R259<'Grading Scale'!G$3,'Grading Scale'!B$5,'Grading Scale'!B$3))))))","v":3},{"$f":"Scores!B250","v":0},{"$f":"IF(S259>='Grading Scale'!B$13,IF(S259='Grading Scale'!B$3,'Grading Scale'!C$3,IF(S259='Grading Scale'!B$5,'Grading Scale'!C$5,IF(S259='Grading Scale'!B$7,'Grading Scale'!C$7,IF(S259='Grading Scale'!B$9,'Grading Scale'!C$9,IF(S259='Grading Scale'!B$11,'Grading Scale'!C$11,'Grading Scale'!C$13))))),IF(S259='Grading Scale'!E$3,'Grading Scale'!F$3,IF(S259='Grading Scale'!E$5,'Grading Scale'!F$5,IF(S259='Grading Scale'!E$7,'Grading Scale'!F$7,IF(S259='Grading Scale'!E$9,'Grading Scale'!F$9,IF(S259='Grading Scale'!E$11,'Grading Scale'!F$11,'Grading Scale'!F$13))))))","v":"B    "}," ",null,""]
[{"$f":"Scores!A251","v":0},{"$f":"Scores!B251","v":0},{"$f":"Scores!C251","v":0},{"$f":"Scores!D251","v":0},{"$f":"Scores!E251","v":0},{"$f":"Scores!F251","v":0},{"$f":"Scores!G251","v":0},{"$f":"Scores!H251","v":0},{"$f":"Scores!I251","v":0},{"$f":"Scores!J251","v":0},{"$f":"Scores!K251","v":0},{"$f":"Scores!L251","v":0},{"$f":"Scores!M251","v":0},{"$f":"Scores!N251","v":0},{"$f":"Scores!O251","v":0},-0.70710678118654746,2.9512994231491119,2.9512994231491119,{"$f":"IF(R260<'Grading Scale'!G$8,IF(R260<'Grading Scale'!G$13,'Grading Scale'!E$13,IF(R260<'Grading Scale'!G$12,'Grading Scale'!E$11,IF(R260<'Grading Scale'!G$11,'Grading Scale'!E$9,IF(R260<'Grading Scale'!G$10,'Grading Scale'!E$7,IF(R260<'Grading Scale'!G$9,'Grading Scale'!E$5,'Grading Scale'!E$3))))),IF(R260<'Grading Scale'!G$7,'Grading Scale'!B$13,IF(R260<'Grading Scale'!G$6,'Grading Scale'!B$11,IF(R260<'Grading Scale'!G$5,'Grading Scale'!B$9,IF(R260<'Grading Scale'!G$4,'Grading Scale'!B$7,IF(R260<'Grading Scale'!G$3,'Grading Scale'!B$5,'Grading Scale'!B$3))))))","v":3},{"$f":"Scores!B251","v":0},{"$f":"IF(S260>='Grading Scale'!B$13,IF(S260='Grading Scale'!B$3,'Grading Scale'!C$3,IF(S260='Grading Scale'!B$5,'Grading Scale'!C$5,IF(S260='Grading Scale'!B$7,'Grading Scale'!C$7,IF(S260='Grading Scale'!B$9,'Grading Scale'!C$9,IF(S260='Grading Scale'!B$11,'Grading Scale'!C$11,'Grading Scale'!C$13))))),IF(S260='Grading Scale'!E$3,'Grading Scale'!F$3,IF(S260='Grading Scale'!E$5,'Grading Scale'!F$5,IF(S260='Grading Scale'!E$7,'Grading Scale'!F$7,IF(S260='Grading Scale'!E$9,'Grading Scale'!F$9,IF(S260='Grading Scale'!E$11,'Grading Scale'!F$11,'Grading Scale'!F$13))))))","v":"B    "}," ",null,""]
[{"$f":"Scores!A252","v":0},{"$f":"Scores!B252","v":0},{"$f":"Scores!C252","v":0},{"$f":"Scores!D252","v":0},{"$f":"Scores!E252","v":0},{"$f":"Scores!F252","v":0},{"$f":"Scores!G252","v":0},{"$f":"Scores!H252","v":0},{"$f":"Scores!I252","v":0},{"$f":"Scores!J252","v":0},{"$f":"Scores!K252","v":0},{"$f":"Scores!L252","v":0},{"$f":"Scores!M252","v":0},{"$f":"Scores!N252","v":0},{"$f":"Scores!O252","v":0},-0.70710678118654746,2.9512994231491119,2.9512994231491119,{"$f":"IF(R261<'Grading Scale'!G$8,IF(R261<'Grading Scale'!G$13,'Grading Scale'!E$13,IF(R261<'Grading Scale'!G$12,'Grading Scale'!E$11,IF(R261<'Grading Scale'!G$11,'Grading Scale'!E$9,IF(R261<'Grading Scale'!G$10,'Grading Scale'!E$7,IF(R261<'Grading Scale'!G$9,'Grading Scale'!E$5,'Grading Scale'!E$3))))),IF(R261<'Grading Scale'!G$7,'Grading Scale'!B$13,IF(R261<'Grading Scale'!G$6,'Grading Scale'!B$11,IF(R261<'Grading Scale'!G$5,'Grading Scale'!B$9,IF(R261<'Grading Scale'!G$4,'Grading Scale'!B$7,IF(R261<'Grading Scale'!G$3,'Grading Scale'!B$5,'Grading Scale'!B$3))))))","v":3},{"$f":"Scores!B252","v":0},{"$f":"IF(S261>='Grading Scale'!B$13,IF(S261='Grading Scale'!B$3,'Grading Scale'!C$3,IF(S261='Grading Scale'!B$5,'Grading Scale'!C$5,IF(S261='Grading Scale'!B$7,'Grading Scale'!C$7,IF(S261='Grading Scale'!B$9,'Grading Scale'!C$9,IF(S261='Grading Scale'!B$11,'Grading Scale'!C$11,'Grading Scale'!C$13))))),IF(S261='Grading Scale'!E$3,'Grading Scale'!F$3,IF(S261='Grading Scale'!E$5,'Grading Scale'!F$5,IF(S261='Grading Scale'!E$7,'Grading Scale'!F$7,IF(S261='Grading Scale'!E$9,'Grading Scale'!F$9,IF(S261='Grading Scale'!E$11,'Grading Scale'!F$11,'Grading Scale'!F$13))))))","v":"B    "}," ",null,""]
[{"$f":"Scores!A253","v":0},{"$f":"Scores!B253","v":0},{"$f":"Scores!C253","v":0},{"$f":"Scores!D253","v":0},{"$f":"Scores!E253","v":0},{"$f":"Scores!F253","v":0},{"$f":"Scores!G253","v":0},{"$f":"Scores!H253","v":0},{"$f":"Scores!I253","v":0},{"$f":"Scores!J253","v":0},{"$f":"Scores!K253","v":0},{"$f":"Scores!L253","v":0},{"$f":"Scores!M253","v":0},{"$f":"Scores!N253","v":0},{"$f":"Scores!O253","v":0},-0.70710678118654746,2.9512994231491119,2.9512994231491119,{"$f":"IF(R262<'Grading Scale'!G$8,IF(R262<'Grading Scale'!G$13,'Grading Scale'!E$13,IF(R262<'Grading Scale'!G$12,'Grading Scale'!E$11,IF(R262<'Grading Scale'!G$11,'Grading Scale'!E$9,IF(R262<'Grading Scale'!G$10,'Grading Scale'!E$7,IF(R262<'Grading Scale'!G$9,'Grading Scale'!E$5,'Grading Scale'!E$3))))),IF(R262<'Grading Scale'!G$7,'Grading Scale'!B$13,IF(R262<'Grading Scale'!G$6,'Grading Scale'!B$11,IF(R262<'Grading Scale'!G$5,'Grading Scale'!B$9,IF(R262<'Grading Scale'!G$4,'Grading Scale'!B$7,IF(R262<'Grading Scale'!G$3,'Grading Scale'!B$5,'Grading Scale'!B$3))))))","v":3},{"$f":"Scores!B253","v":0},{"$f":"IF(S262>='Grading Scale'!B$13,IF(S262='Grading Scale'!B$3,'Grading Scale'!C$3,IF(S262='Grading Scale'!B$5,'Grading Scale'!C$5,IF(S262='Grading Scale'!B$7,'Grading Scale'!C$7,IF(S262='Grading Scale'!B$9,'Grading Scale'!C$9,IF(S262='Grading Scale'!B$11,'Grading Scale'!C$11,'Grading Scale'!C$13))))),IF(S262='Grading Scale'!E$3,'Grading Scale'!F$3,IF(S262='Grading Scale'!E$5,'Grading Scale'!F$5,IF(S262='Grading Scale'!E$7,'Grading Scale'!F$7,IF(S262='Grading Scale'!E$9,'Grading Scale'!F$9,IF(S262='Grading Scale'!E$11,'Grading Scale'!F$11,'Grading Scale'!F$13))))))","v":"B    "}," ",null,""]
[{"$f":"Scores!A254","v":0},{"$f":"Scores!B254","v":0},{"$f":"Scores!C254","v":0},{"$f":"Scores!D254","v":0},{"$f":"Scores!E254","v":0},{"$f":"Scores!F254","v":0},{"$f":"Scores!G254","v":0},{"$f":"Scores!H254","v":0},{"$f":"Scores!I254","v":0},{"$f":"Scores!J254","v":0},{"$f":"Scores!K254","v":0},{"$f":"Scores!L254","v":0},{"$f":"Scores!M254","v":0},{"$f":"Scores!N254","v":0},{"$f":"Scores!O254","v":0},-0.70710678118654746,2.9512994231491119,2.9512994231491119,{"$f":"IF(R263<'Grading Scale'!G$8,IF(R263<'Grading Scale'!G$13,'Grading Scale'!E$13,IF(R263<'Grading Scale'!G$12,'Grading Scale'!E$11,IF(R263<'Grading Scale'!G$11,'Grading Scale'!E$9,IF(R263<'Grading Scale'!G$10,'Grading Scale'!E$7,IF(R263<'Grading Scale'!G$9,'Grading Scale'!E$5,'Grading Scale'!E$3))))),IF(R263<'Grading Scale'!G$7,'Grading Scale'!B$13,IF(R263<'Grading Scale'!G$6,'Grading Scale'!B$11,IF(R263<'Grading Scale'!G$5,'Grading Scale'!B$9,IF(R263<'Grading Scale'!G$4,'Grading Scale'!B$7,IF(R263<'Grading Scale'!G$3,'Grading Scale'!B$5,'Grading Scale'!B$3))))))","v":3},{"$f":"Scores!B254","v":0},{"$f":"IF(S263>='Grading Scale'!B$13,IF(S263='Grading Scale'!B$3,'Grading Scale'!C$3,IF(S263='Grading Scale'!B$5,'Grading Scale'!C$5,IF(S263='Grading Scale'!B$7,'Grading Scale'!C$7,IF(S263='Grading Scale'!B$9,'Grading Scale'!C$9,IF(S263='Grading Scale'!B$11,'Grading Scale'!C$11,'Grading Scale'!C$13))))),IF(S263='Grading Scale'!E$3,'Grading Scale'!F$3,IF(S263='Grading Scale'!E$5,'Grading Scale'!F$5,IF(S263='Grading Scale'!E$7,'Grading Scale'!F$7,IF(S263='Grading Scale'!E$9,'Grading Scale'!F$9,IF(S263='Grading Scale'!E$11,'Grading Scale'!F$11,'Grading Scale'!F$13))))))","v":"B    "}," ",null,""]
[{"$f":"Scores!A255","v":0},{"$f":"Scores!B255","v":0},{"$f":"Scores!C255","v":0},{"$f":"Scores!D255","v":0},{"$f":"Scores!E255","v":0},{"$f":"Scores!F255","v":0},{"$f":"Scores!G255","v":0},{"$f":"Scores!H255","v":0},{"$f":"Scores!I255","v":0},{"$f":"Scores!J255","v":0},{"$f":"Scores!K255","v":0},{"$f":"Scores!L255","v":0},{"$f":"Scores!M255","v":0},{"$f":"Scores!N255","v":0},{"$f":"Scores!O255","v":0},-0.70710678118654746,2.9512994231491119,2.9512994231491119,{"$f":"IF(R264<'Grading Scale'!G$8,IF(R264<'Grading Scale'!G$13,'Grading Scale'!E$13,IF(R264<'Grading Scale'!G$12,'Grading Scale'!E$11,IF(R264<'Grading Scale'!G$11,'Grading Scale'!E$9,IF(R264<'Grading Scale'!G$10,'Grading Scale'!E$7,IF(R264<'Grading Scale'!G$9,'Grading Scale'!E$5,'Grading Scale'!E$3))))),IF(R264<'Grading Scale'!G$7,'Grading Scale'!B$13,IF(R264<'Grading Scale'!G$6,'Grading Scale'!B$11,IF(R264<'Grading Scale'!G$5,'Grading Scale'!B$9,IF(R264<'Grading Scale'!G$4,'Grading Scale'!B$7,IF(R264<'Grading Scale'!G$3,'Grading Scale'!B$5,'Grading Scale'!B$3))))))","v":3},{"$f":"Scores!B255","v":0},{"$f":"IF(S264>='Grading Scale'!B$13,IF(S264='Grading Scale'!B$3,'Grading Scale'!C$3,IF(S264='Grading Scale'!B$5,'Grading Scale'!C$5,IF(S264='Grading Scale'!B$7,'Grading Scale'!C$7,IF(S264='Grading Scale'!B$9,'Grading Scale'!C$9,IF(S264='Grading Scale'!B$11,'Grading Scale'!C$11,'Grading Scale'!C$13))))),IF(S264='Grading Scale'!E$3,'Grading Scale'!F$3,IF(S264='Grading Scale'!E$5,'Grading Scale'!F$5,IF(S264='Grading Scale'!E$7,'Grading Scale'!F$7,IF(S264='Grading Scale'!E$9,'Grading Scale'!F$9,IF(S264='Grading Scale'!E$11,'Grading Scale'!F$11,'Grading Scale'!F$13))))))","v":"B    "}," ",null,""]
[{"$f":"Scores!A256","v":0},{"$f":"Scores!B256","v":0},{"$f":"Scores!C256","v":0},{"$f":"Scores!D256","v":0},{"$f":"Scores!E256","v":0},{"$f":"Scores!F256","v":0},{"$f":"Scores!G256","v":0},{"$f":"Scores!H256","v":0},{"$f":"Scores!I256","v":0},{"$f":"Scores!J256","v":0},{"$f":"Scores!K256","v":0},{"$f":"Scores!L256","v":0},{"$f":"Scores!M256","v":0},{"$f":"Scores!N256","v":0},{"$f":"Scores!O256","v":0},-0.70710678118654746,2.9512994231491119,2.9512994231491119,{"$f":"IF(R265<'Grading Scale'!G$8,IF(R265<'Grading Scale'!G$13,'Grading Scale'!E$13,IF(R265<'Grading Scale'!G$12,'Grading Scale'!E$11,IF(R265<'Grading Scale'!G$11,'Grading Scale'!E$9,IF(R265<'Grading Scale'!G$10,'Grading Scale'!E$7,IF(R265<'Grading Scale'!G$9,'Grading Scale'!E$5,'Grading Scale'!E$3))))),IF(R265<'Grading Scale'!G$7,'Grading Scale'!B$13,IF(R265<'Grading Scale'!G$6,'Grading Scale'!B$11,IF(R265<'Grading Scale'!G$5,'Grading Scale'!B$9,IF(R265<'Grading Scale'!G$4,'Grading Scale'!B$7,IF(R265<'Grading Scale'!G$3,'Grading Scale'!B$5,'Grading Scale'!B$3))))))","v":3},{"$f":"Scores!B256","v":0},{"$f":"IF(S265>='Grading Scale'!B$13,IF(S265='Grading Scale'!B$3,'Grading Scale'!C$3,IF(S265='Grading Scale'!B$5,'Grading Scale'!C$5,IF(S265='Grading Scale'!B$7,'Grading Scale'!C$7,IF(S265='Grading Scale'!B$9,'Grading Scale'!C$9,IF(S265='Grading Scale'!B$11,'Grading Scale'!C$11,'Grading Scale'!C$13))))),IF(S265='Grading Scale'!E$3,'Grading Scale'!F$3,IF(S265='Grading Scale'!E$5,'Grading Scale'!F$5,IF(S265='Grading Scale'!E$7,'Grading Scale'!F$7,IF(S265='Grading Scale'!E$9,'Grading Scale'!F$9,IF(S265='Grading Scale'!E$11,'Grading Scale'!F$11,'Grading Scale'!F$13))))))","v":"B    "}," ",null,""]
[{"$f":"Scores!A257","v":0},{"$f":"Scores!B257","v":0},{"$f":"Scores!C257","v":0},{"$f":"Scores!D257","v":0},{"$f":"Scores!E257","v":0},{"$f":"Scores!F257","v":0},{"$f":"Scores!G257","v":0},{"$f":"Scores!H257","v":0},{"$f":"Scores!I257","v":0},{"$f":"Scores!J257","v":0},{"$f":"Scores!K257","v":0},{"$f":"Scores!L257","v":0},{"$f":"Scores!M257","v":0},{"$f":"Scores!N257","v":0},{"$f":"Scores!O257","v":0},-0.70710678118654746,2.9512994231491119,2.9512994231491119,{"$f":"IF(R266<'Grading Scale'!G$8,IF(R266<'Grading Scale'!G$13,'Grading Scale'!E$13,IF(R266<'Grading Scale'!G$12,'Grading Scale'!E$11,IF(R266<'Grading Scale'!G$11,'Grading Scale'!E$9,IF(R266<'Grading Scale'!G$10,'Grading Scale'!E$7,IF(R266<'Grading Scale'!G$9,'Grading Scale'!E$5,'Grading Scale'!E$3))))),IF(R266<'Grading Scale'!G$7,'Grading Scale'!B$13,IF(R266<'Grading Scale'!G$6,'Grading Scale'!B$11,IF(R266<'Grading Scale'!G$5,'Grading Scale'!B$9,IF(R266<'Grading Scale'!G$4,'Grading Scale'!B$7,IF(R266<'Grading Scale'!G$3,'Grading Scale'!B$5,'Grading Scale'!B$3))))))","v":3},{"$f":"Scores!B257","v":0},{"$f":"IF(S266>='Grading Scale'!B$13,IF(S266='Grading Scale'!B$3,'Grading Scale'!C$3,IF(S266='Grading Scale'!B$5,'Grading Scale'!C$5,IF(S266='Grading Scale'!B$7,'Grading Scale'!C$7,IF(S266='Grading Scale'!B$9,'Grading Scale'!C$9,IF(S266='Grading Scale'!B$11,'Grading Scale'!C$11,'Grading Scale'!C$13))))),IF(S266='Grading Scale'!E$3,'Grading Scale'!F$3,IF(S266='Grading Scale'!E$5,'Grading Scale'!F$5,IF(S266='Grading Scale'!E$7,'Grading Scale'!F$7,IF(S266='Grading Scale'!E$9,'Grading Scale'!F$9,IF(S266='Grading Scale'!E$11,'Grading Scale'!F$11,'Grading Scale'!F$13))))))","v":"B    "}," ",null,""]
[{"$f":"Scores!A258","v":0},{"$f":"Scores!B258","v":0},{"$f":"Scores!C258","v":0},{"$f":"Scores!D258","v":0},{"$f":"Scores!E258","v":0},{"$f":"Scores!F258","v":0},{"$f":"Scores!G258","v":0},{"$f":"Scores!H258","v":0},{"$f":"Scores!I258","v":0},{"$f":"Scores!J258","v":0},{"$f":"Scores!K258","v":0},{"$f":"Scores!L258","v":0},{"$f":"Scores!M258","v":0},{"$f":"Scores!N258","v":0},{"$f":"Scores!O258","v":0},-0.70710678118654746,2.9512994231491119,2.9512994231491119,{"$f":"IF(R267<'Grading Scale'!G$8,IF(R267<'Grading Scale'!G$13,'Grading Scale'!E$13,IF(R267<'Grading Scale'!G$12,'Grading Scale'!E$11,IF(R267<'Grading Scale'!G$11,'Grading Scale'!E$9,IF(R267<'Grading Scale'!G$10,'Grading Scale'!E$7,IF(R267<'Grading Scale'!G$9,'Grading Scale'!E$5,'Grading Scale'!E$3))))),IF(R267<'Grading Scale'!G$7,'Grading Scale'!B$13,IF(R267<'Grading Scale'!G$6,'Grading Scale'!B$11,IF(R267<'Grading Scale'!G$5,'Grading Scale'!B$9,IF(R267<'Grading Scale'!G$4,'Grading Scale'!B$7,IF(R267<'Grading Scale'!G$3,'Grading Scale'!B$5,'Grading Scale'!B$3))))))","v":3},{"$f":"Scores!B258","v":0},{"$f":"IF(S267>='Grading Scale'!B$13,IF(S267='Grading Scale'!B$3,'Grading Scale'!C$3,IF(S267='Grading Scale'!B$5,'Grading Scale'!C$5,IF(S267='Grading Scale'!B$7,'Grading Scale'!C$7,IF(S267='Grading Scale'!B$9,'Grading Scale'!C$9,IF(S267='Grading Scale'!B$11,'Grading Scale'!C$11,'Grading Scale'!C$13))))),IF(S267='Grading Scale'!E$3,'Grading Scale'!F$3,IF(S267='Grading Scale'!E$5,'Grading Scale'!F$5,IF(S267='Grading Scale'!E$7,'Grading Scale'!F$7,IF(S267='Grading Scale'!E$9,'Grading Scale'!F$9,IF(S267='Grading Scale'!E$11,'Grading Scale'!F$11,'Grading Scale'!F$13))))))","v":"B    "}," ",null,""]
[{"$f":"Scores!A259","v":0},{"$f":"Scores!B259","v":0},{"$f":"Scores!C259","v":0},{"$f":"Scores!D259","v":0},{"$f":"Scores!E259","v":0},{"$f":"Scores!F259","v":0},{"$f":"Scores!G259","v":0},{"$f":"Scores!H259","v":0},{"$f":"Scores!I259","v":0},{"$f":"Scores!J259","v":0},{"$f":"Scores!K259","v":0},{"$f":"Scores!L259","v":0},{"$f":"Scores!M259","v":0},{"$f":"Scores!N259","v":0},{"$f":"Scores!O259","v":0},-0.70710678118654746,2.9512994231491119,2.9512994231491119,{"$f":"IF(R268<'Grading Scale'!G$8,IF(R268<'Grading Scale'!G$13,'Grading Scale'!E$13,IF(R268<'Grading Scale'!G$12,'Grading Scale'!E$11,IF(R268<'Grading Scale'!G$11,'Grading Scale'!E$9,IF(R268<'Grading Scale'!G$10,'Grading Scale'!E$7,IF(R268<'Grading Scale'!G$9,'Grading Scale'!E$5,'Grading Scale'!E$3))))),IF(R268<'Grading Scale'!G$7,'Grading Scale'!B$13,IF(R268<'Grading Scale'!G$6,'Grading Scale'!B$11,IF(R268<'Grading Scale'!G$5,'Grading Scale'!B$9,IF(R268<'Grading Scale'!G$4,'Grading Scale'!B$7,IF(R268<'Grading Scale'!G$3,'Grading Scale'!B$5,'Grading Scale'!B$3))))))","v":3},{"$f":"Scores!B259","v":0},{"$f":"IF(S268>='Grading Scale'!B$13,IF(S268='Grading Scale'!B$3,'Grading Scale'!C$3,IF(S268='Grading Scale'!B$5,'Grading Scale'!C$5,IF(S268='Grading Scale'!B$7,'Grading Scale'!C$7,IF(S268='Grading Scale'!B$9,'Grading Scale'!C$9,IF(S268='Grading Scale'!B$11,'Grading Scale'!C$11,'Grading Scale'!C$13))))),IF(S268='Grading Scale'!E$3,'Grading Scale'!F$3,IF(S268='Grading Scale'!E$5,'Grading Scale'!F$5,IF(S268='Grading Scale'!E$7,'Grading Scale'!F$7,IF(S268='Grading Scale'!E$9,'Grading Scale'!F$9,IF(S268='Grading Scale'!E$11,'Grading Scale'!F$11,'Grading Scale'!F$13))))))","v":"B    "}," ",null,""]
[{"$f":"Scores!A260","v":0},{"$f":"Scores!B260","v":0},{"$f":"Scores!C260","v":0},{"$f":"Scores!D260","v":0},{"$f":"Scores!E260","v":0},{"$f":"Scores!F260","v":0},{"$f":"Scores!G260","v":0},{"$f":"Scores!H260","v":0},{"$f":"Scores!I260","v":0},{"$f":"Scores!J260","v":0},{"$f":"Scores!K260","v":0},{"$f":"Scores!L260","v":0},{"$f":"Scores!M260","v":0},{"$f":"Scores!N260","v":0},{"$f":"Scores!O260","v":0},-0.70710678118654746,2.9512994231491119,2.9512994231491119,{"$f":"IF(R269<'Grading Scale'!G$8,IF(R269<'Grading Scale'!G$13,'Grading Scale'!E$13,IF(R269<'Grading Scale'!G$12,'Grading Scale'!E$11,IF(R269<'Grading Scale'!G$11,'Grading Scale'!E$9,IF(R269<'Grading Scale'!G$10,'Grading Scale'!E$7,IF(R269<'Grading Scale'!G$9,'Grading Scale'!E$5,'Grading Scale'!E$3))))),IF(R269<'Grading Scale'!G$7,'Grading Scale'!B$13,IF(R269<'Grading Scale'!G$6,'Grading Scale'!B$11,IF(R269<'Grading Scale'!G$5,'Grading Scale'!B$9,IF(R269<'Grading Scale'!G$4,'Grading Scale'!B$7,IF(R269<'Grading Scale'!G$3,'Grading Scale'!B$5,'Grading Scale'!B$3))))))","v":3},{"$f":"Scores!B260","v":0},{"$f":"IF(S269>='Grading Scale'!B$13,IF(S269='Grading Scale'!B$3,'Grading Scale'!C$3,IF(S269='Grading Scale'!B$5,'Grading Scale'!C$5,IF(S269='Grading Scale'!B$7,'Grading Scale'!C$7,IF(S269='Grading Scale'!B$9,'Grading Scale'!C$9,IF(S269='Grading Scale'!B$11,'Grading Scale'!C$11,'Grading Scale'!C$13))))),IF(S269='Grading Scale'!E$3,'Grading Scale'!F$3,IF(S269='Grading Scale'!E$5,'Grading Scale'!F$5,IF(S269='Grading Scale'!E$7,'Grading Scale'!F$7,IF(S269='Grading Scale'!E$9,'Grading Scale'!F$9,IF(S269='Grading Scale'!E$11,'Grading Scale'!F$11,'Grading Scale'!F$13))))))","v":"B    "}," ",null,""]
[{"$f":"Scores!A261","v":0},{"$f":"Scores!B261","v":0},{"$f":"Scores!C261","v":0},{"$f":"Scores!D261","v":0},{"$f":"Scores!E261","v":0},{"$f":"Scores!F261","v":0},{"$f":"Scores!G261","v":0},{"$f":"Scores!H261","v":0},{"$f":"Scores!I261","v":0},{"$f":"Scores!J261","v":0},{"$f":"Scores!K261","v":0},{"$f":"Scores!L261","v":0},{"$f":"Scores!M261","v":0},{"$f":"Scores!N261","v":0},{"$f":"Scores!O261","v":0},-0.70710678118654746,2.9512994231491119,2.9512994231491119,{"$f":"IF(R270<'Grading Scale'!G$8,IF(R270<'Grading Scale'!G$13,'Grading Scale'!E$13,IF(R270<'Grading Scale'!G$12,'Grading Scale'!E$11,IF(R270<'Grading Scale'!G$11,'Grading Scale'!E$9,IF(R270<'Grading Scale'!G$10,'Grading Scale'!E$7,IF(R270<'Grading Scale'!G$9,'Grading Scale'!E$5,'Grading Scale'!E$3))))),IF(R270<'Grading Scale'!G$7,'Grading Scale'!B$13,IF(R270<'Grading Scale'!G$6,'Grading Scale'!B$11,IF(R270<'Grading Scale'!G$5,'Grading Scale'!B$9,IF(R270<'Grading Scale'!G$4,'Grading Scale'!B$7,IF(R270<'Grading Scale'!G$3,'Grading Scale'!B$5,'Grading Scale'!B$3))))))","v":3},{"$f":"Scores!B261","v":0},{"$f":"IF(S270>='Grading Scale'!B$13,IF(S270='Grading Scale'!B$3,'Grading Scale'!C$3,IF(S270='Grading Scale'!B$5,'Grading Scale'!C$5,IF(S270='Grading Scale'!B$7,'Grading Scale'!C$7,IF(S270='Grading Scale'!B$9,'Grading Scale'!C$9,IF(S270='Grading Scale'!B$11,'Grading Scale'!C$11,'Grading Scale'!C$13))))),IF(S270='Grading Scale'!E$3,'Grading Scale'!F$3,IF(S270='Grading Scale'!E$5,'Grading Scale'!F$5,IF(S270='Grading Scale'!E$7,'Grading Scale'!F$7,IF(S270='Grading Scale'!E$9,'Grading Scale'!F$9,IF(S270='Grading Scale'!E$11,'Grading Scale'!F$11,'Grading Scale'!F$13))))))","v":"B    "}," ",null,""]
[{"$f":"Scores!A262","v":0},{"$f":"Scores!B262","v":0},{"$f":"Scores!C262","v":0},{"$f":"Scores!D262","v":0},{"$f":"Scores!E262","v":0},{"$f":"Scores!F262","v":0},{"$f":"Scores!G262","v":0},{"$f":"Scores!H262","v":0},{"$f":"Scores!I262","v":0},{"$f":"Scores!J262","v":0},{"$f":"Scores!K262","v":0},{"$f":"Scores!L262","v":0},{"$f":"Scores!M262","v":0},{"$f":"Scores!N262","v":0},{"$f":"Scores!O262","v":0},-0.70710678118654746,2.9512994231491119,2.9512994231491119,{"$f":"IF(R271<'Grading Scale'!G$8,IF(R271<'Grading Scale'!G$13,'Grading Scale'!E$13,IF(R271<'Grading Scale'!G$12,'Grading Scale'!E$11,IF(R271<'Grading Scale'!G$11,'Grading Scale'!E$9,IF(R271<'Grading Scale'!G$10,'Grading Scale'!E$7,IF(R271<'Grading Scale'!G$9,'Grading Scale'!E$5,'Grading Scale'!E$3))))),IF(R271<'Grading Scale'!G$7,'Grading Scale'!B$13,IF(R271<'Grading Scale'!G$6,'Grading Scale'!B$11,IF(R271<'Grading Scale'!G$5,'Grading Scale'!B$9,IF(R271<'Grading Scale'!G$4,'Grading Scale'!B$7,IF(R271<'Grading Scale'!G$3,'Grading Scale'!B$5,'Grading Scale'!B$3))))))","v":3},{"$f":"Scores!B262","v":0},{"$f":"IF(S271>='Grading Scale'!B$13,IF(S271='Grading Scale'!B$3,'Grading Scale'!C$3,IF(S271='Grading Scale'!B$5,'Grading Scale'!C$5,IF(S271='Grading Scale'!B$7,'Grading Scale'!C$7,IF(S271='Grading Scale'!B$9,'Grading Scale'!C$9,IF(S271='Grading Scale'!B$11,'Grading Scale'!C$11,'Grading Scale'!C$13))))),IF(S271='Grading Scale'!E$3,'Grading Scale'!F$3,IF(S271='Grading Scale'!E$5,'Grading Scale'!F$5,IF(S271='Grading Scale'!E$7,'Grading Scale'!F$7,IF(S271='Grading Scale'!E$9,'Grading Scale'!F$9,IF(S271='Grading Scale'!E$11,'Grading Scale'!F$11,'Grading Scale'!F$13))))))","v":"B    "}," ",null,""]
[{"$f":"Scores!A263","v":0},{"$f":"Scores!B263","v":0},{"$f":"Scores!C263","v":0},{"$f":"Scores!D263","v":0},{"$f":"Scores!E263","v":0},{"$f":"Scores!F263","v":0},{"$f":"Scores!G263","v":0},{"$f":"Scores!H263","v":0},{"$f":"Scores!I263","v":0},{"$f":"Scores!J263","v":0},{"$f":"Scores!K263","v":0},{"$f":"Scores!L263","v":0},{"$f":"Scores!M263","v":0},{"$f":"Scores!N263","v":0},{"$f":"Scores!O263","v":0},-0.70710678118654746,2.9512994231491119,2.9512994231491119,{"$f":"IF(R272<'Grading Scale'!G$8,IF(R272<'Grading Scale'!G$13,'Grading Scale'!E$13,IF(R272<'Grading Scale'!G$12,'Grading Scale'!E$11,IF(R272<'Grading Scale'!G$11,'Grading Scale'!E$9,IF(R272<'Grading Scale'!G$10,'Grading Scale'!E$7,IF(R272<'Grading Scale'!G$9,'Grading Scale'!E$5,'Grading Scale'!E$3))))),IF(R272<'Grading Scale'!G$7,'Grading Scale'!B$13,IF(R272<'Grading Scale'!G$6,'Grading Scale'!B$11,IF(R272<'Grading Scale'!G$5,'Grading Scale'!B$9,IF(R272<'Grading Scale'!G$4,'Grading Scale'!B$7,IF(R272<'Grading Scale'!G$3,'Grading Scale'!B$5,'Grading Scale'!B$3))))))","v":3},{"$f":"Scores!B263","v":0},{"$f":"IF(S272>='Grading Scale'!B$13,IF(S272='Grading Scale'!B$3,'Grading Scale'!C$3,IF(S272='Grading Scale'!B$5,'Grading Scale'!C$5,IF(S272='Grading Scale'!B$7,'Grading Scale'!C$7,IF(S272='Grading Scale'!B$9,'Grading Scale'!C$9,IF(S272='Grading Scale'!B$11,'Grading Scale'!C$11,'Grading Scale'!C$13))))),IF(S272='Grading Scale'!E$3,'Grading Scale'!F$3,IF(S272='Grading Scale'!E$5,'Grading Scale'!F$5,IF(S272='Grading Scale'!E$7,'Grading Scale'!F$7,IF(S272='Grading Scale'!E$9,'Grading Scale'!F$9,IF(S272='Grading Scale'!E$11,'Grading Scale'!F$11,'Grading Scale'!F$13))))))","v":"B    "}," ",null,""]
[{"$f":"Scores!A264","v":0},{"$f":"Scores!B264","v":0},{"$f":"Scores!C264","v":0},{"$f":"Scores!D264","v":0},{"$f":"Scores!E264","v":0},{"$f":"Scores!F264","v":0},{"$f":"Scores!G264","v":0},{"$f":"Scores!H264","v":0},{"$f":"Scores!I264","v":0},{"$f":"Scores!J264","v":0},{"$f":"Scores!K264","v":0},{"$f":"Scores!L264","v":0},{"$f":"Scores!M264","v":0},{"$f":"Scores!N264","v":0},{"$f":"Scores!O264","v":0},-0.70710678118654746,2.9512994231491119,2.9512994231491119,{"$f":"IF(R273<'Grading Scale'!G$8,IF(R273<'Grading Scale'!G$13,'Grading Scale'!E$13,IF(R273<'Grading Scale'!G$12,'Grading Scale'!E$11,IF(R273<'Grading Scale'!G$11,'Grading Scale'!E$9,IF(R273<'Grading Scale'!G$10,'Grading Scale'!E$7,IF(R273<'Grading Scale'!G$9,'Grading Scale'!E$5,'Grading Scale'!E$3))))),IF(R273<'Grading Scale'!G$7,'Grading Scale'!B$13,IF(R273<'Grading Scale'!G$6,'Grading Scale'!B$11,IF(R273<'Grading Scale'!G$5,'Grading Scale'!B$9,IF(R273<'Grading Scale'!G$4,'Grading Scale'!B$7,IF(R273<'Grading Scale'!G$3,'Grading Scale'!B$5,'Grading Scale'!B$3))))))","v":3},{"$f":"Scores!B264","v":0},{"$f":"IF(S273>='Grading Scale'!B$13,IF(S273='Grading Scale'!B$3,'Grading Scale'!C$3,IF(S273='Grading Scale'!B$5,'Grading Scale'!C$5,IF(S273='Grading Scale'!B$7,'Grading Scale'!C$7,IF(S273='Grading Scale'!B$9,'Grading Scale'!C$9,IF(S273='Grading Scale'!B$11,'Grading Scale'!C$11,'Grading Scale'!C$13))))),IF(S273='Grading Scale'!E$3,'Grading Scale'!F$3,IF(S273='Grading Scale'!E$5,'Grading Scale'!F$5,IF(S273='Grading Scale'!E$7,'Grading Scale'!F$7,IF(S273='Grading Scale'!E$9,'Grading Scale'!F$9,IF(S273='Grading Scale'!E$11,'Grading Scale'!F$11,'Grading Scale'!F$13))))))","v":"B    "}," ",null,""]